{"text_format":"1","workbook":"xlsx","n_sheets":10,"sheets":["Informações","Ações gerais","Ações Cultura Viva","Operacionalização","Lista de Contemplados Geral","Lista Contemplados PNCV","Dados","Config","MapaCPFsGeral","MapaCPFsPNCV"],"not_rendered":{"charts":0,"images":1,"macros":1,"external_links":0,"defined_names":5,"comments":2,"pivot_tables":0},"unopened":[],"bounds":{"document_bytes":16777216,"sheet_cells":100000,"rows_first":2000,"rows_last":500,"rows_between":2000,"halvings":0,"cell_chars":16384,"cell_head_chars":4096},"cells_cut":0,"cells_raw":0,"read":"whole","date_system":"1900"}

{"sheet":"Informações","index":0,"n_rows":30,"n_cols":7,"rows_kept":30,"cut":false,"hidden":false,"merged":[[29,1,29,6],[27,2,27,3],[26,2,26,3],[18,4,18,6],[19,4,19,6],[21,0,21,6],[22,5,22,6],[23,5,23,6],[24,1,24,6],[28,2,28,3],[11,0,11,6],[13,0,13,6],[14,2,14,4],[15,2,15,4],[17,0,17,6],[3,0,3,6],[7,0,7,6],[1,0,1,6],[4,5,4,6],[5,5,5,6],[4,0,4,1],[5,0,5,1],[4,3,4,4],[5,3,5,4]]}
[]
["GOVERNO FEDERAL\nMinistério da Cultura\nPolítica Nacional Aldir Blanc\nPlanilha de Acompanhamento Ciclo 1."]
[]
["Informações do Município"]
["Nome do município",null,"UF","CNPJ:",null,"Código do Plano de Ação do ciclo 1"]
["NOVA BRASILÂNDIA",null,"MT","15.023.963/0001-88",null,"30882120230005-017765"]
[]
["Informações Financeiras"]
["Valor recebido no ciclo 1 da política","Valor revertido ao estado\n (se houver)","Valor devolvido à União via pagamento de GRU \n(se houver)","Valor ainda bloqueado judicialmente \n(se houver)","Transferiu recursos para outra conta de mesma titularidade ao longo da execução ?","Saldo em conta ao final da execução do ciclo 1","Valor transferido da conta do ciclo 1 para conta do ciclo 2"]
[42844.07,null,null,null,"Não",149.37]
[]
["Resumo das informações das outras abas (preenchimento automático)"]
[]
["Panorama geral - ações gerais, cultura viva e operacionalização"]
[null,null,"Valor total"]
[null,null,{"$f":"SUM(A20+A24+C29)","v":42844.07}]
[]
["Ações gerais"]
["Valor total das atividades","Quantidade de vagas ofertadas","Nº de inscritos","Nº de contemplados","Nº de atividades com recursos para áreas periféricas e/ou de povos tradicionais."]
[{"$f":"'Ações gerais'!D204","v":38501.870000000003},{"$f":"'Ações gerais'!E204","v":32},{"$f":"'Ações gerais'!F204","v":40},{"$f":"'Ações gerais'!G204","v":32},{"$f":"COUNTIF('Ações gerais'!H4:H203,\"Sim\")","v":0}]
[]
["Política Nacional Cultura Viva"]
["Valor total dos editais","Quantidade de vagas ofertadas","Nº de inscritos","Nº de novos pontos credenciados","Número de contemplados","Nº de atividades com recursos para áreas periféricas e/ou de povos tradicionais."]
[{"$f":"'Ações Cultura Viva'!D64","v":2200},{"$f":"'Ações Cultura Viva'!E64","v":1},{"$f":"'Ações Cultura Viva'!F64","v":0},{"$f":"'Ações Cultura Viva'!G64","v":0},{"$f":"'Ações Cultura Viva'!H64","v":0},{"$f":"COUNTIF('Ações Cultura Viva'!I4:I63,\"Sim\")","v":0}]
["Situação:",{"$f":"IF(A10=\"\",\"\",IF(A10>=360000,IF(A24>=0.25*A10,\"A soma dos editais lançados corresponde ao valor obrigatório da PNCV.\",\"Atenção! A soma dos valores dos editais não corresponde ao valor mínimo obrigatório para PNCV.\"),\"\"))","v":""}]
[]
[null,null,"Operacionalização"]
[null,null,"Valor total"]
[null,null,{"$f":"Operacionalização!D94","v":2142.1999999999998}]
["Situação: ",{"$f":"IF(OR(A10=\"\",C29=0),\"\",IF(OR(0.05*A10<C29,C29>6000000), \"Atenção! A soma dos valores não corresponde ao valor máximo permitido para operacionalização.\", \"O município observou o percentual estabelecido na legislação para operacionalização.\"))","v":"O município observou o percentual estabelecido na legislação para operacionalização."}]

{"sheet":"Ações gerais","index":1,"n_rows":204,"n_cols":10,"rows_kept":204,"cut":false,"hidden":false,"merged":[[0,0,0,3]]}
["GOVERNO FEDERAL\nMinistério da Cultura\nPolítica Nacional Aldir Blanc\nPlanilha de Acompanhamento Ciclo 1."]
[{"$f":"CONCATENATE(\"AÇÕES GERAIS - LISTA DE ATIVIDADES - \",UPPER(Informações!A6),\" - \",Informações!C6,\" \",IF(Informações!D6=\"\",\"\",CONCATENATE(\"- CNPJ \",Informações!D6)))","v":"AÇÕES GERAIS - LISTA DE ATIVIDADES - NOVA BRASILÂNDIA - MT - CNPJ 15.023.963/0001-88"}]
["NOME DA ATIVIDADE \n(editais de fomento cultural, aquisição de bens e serviços culturais, contratação de serviços, obras e reformas)","BREVE DESCRIÇÃO DA ATIVIDADE","FORMA DE EXECUÇÃO\n(Selecione um dos itens a seguir)","VALOR TOTAL DA ATIVIDADE","QUANTIDADE DE VAGAS OFERTADAS","Nº DE INSCRITOS","Nº DE CONTEMPLADOS","A atividade destina recursos para áreas periféricas e/ou de povos tradicionais?","Link da publicação do edital no diário oficial ou extratos das parcerias e contratações","Observação"]
["EDITAL DE FOMENTO CULTURAL 002/2024","Premiação de Agentes Culturais que tenham Prestado relevante Contribuição ao Desenvolvimento Artístico ou Cultural no Município de Nova Brasilândia -MT","Chamamento público - Fomento à execução de ações culturais - Projeto (Decreto 11.453/2023 e Lei 14.903/2024) ",38501.870000000003,32,40,32,"Não","https://www.novabrasilandia.mt.gov.br/fotos_licitacao/1125.pdf"]
[]
[]
[]
[]
[]
[]
[]
[]
[]
[]
[]
[]
[]
[]
[]
[]
[]
[]
[]
[]
[]
[]
[]
[]
[]
[]
[]
[]
[]
[]
[]
[]
[]
[]
[]
[]
[]
[]
[]
[]
[]
[]
[]
[]
[]
[]
[]
[]
[]
[]
[]
[]
[]
[]
[]
[]
[]
[]
[]
[]
[]
[]
[]
[]
[]
[]
[]
[]
[]
[]
[]
[]
[]
[]
[]
[]
[]
[]
[]
[]
[]
[]
[]
[]
[]
[]
[]
[]
[]
[]
[]
[]
[]
[]
[]
[]
[]
[]
[]
[]
[]
[]
[]
[]
[]
[]
[]
[]
[]
[]
[]
[]
[]
[]
[]
[]
[]
[]
[]
[]
[]
[]
[]
[]
[]
[]
[]
[]
[]
[]
[]
[]
[]
[]
[]
[]
[]
[]
[]
[]
[]
[]
[]
[]
[]
[]
[]
[]
[]
[]
[]
[]
[]
[]
[]
[]
[]
[]
[]
[]
[]
[]
[]
[]
[]
[]
[]
[]
[]
[]
[]
[]
[]
[]
[]
[]
[]
[]
[]
[]
[]
[]
[]
[]
[]
[]
[]
[]
[]
[]
[]
[]
[]
[]
[]
[]
[]
[]
[]
[null,null,"TOTAL",{"$f":"SUM(D4:D203)","v":38501.870000000003},{"$f":"SUM(E4:E203)","v":32},{"$f":"SUM(F4:F203)","v":40},{"$f":"SUM(G4:G203)","v":32}]

{"sheet":"Ações Cultura Viva","index":2,"n_rows":64,"n_cols":13,"rows_kept":64,"cut":false,"hidden":false,"merged":[[0,0,0,6]]}
["GOVERNO FEDERAL\nMinistério da Cultura\nPolítica Nacional Aldir Blanc\nPlanilha de Acompanhamento Ciclo 1."]
[{"$f":"CONCATENATE(\"CULTURA VIVA - LISTA DE EDITAIS - \",UPPER(Informações!A6),\" - \",Informações!C6,\" - \",\" \",IF(Informações!D6=\"\",\"\",CONCATENATE(\"CNPJ \",Informações!D6)))","v":"CULTURA VIVA - LISTA DE EDITAIS - NOVA BRASILÂNDIA - MT -  CNPJ 15.023.963/0001-88"}]
["TIPO EDITAL CULTURA VIVA","NÚMERO E TÍTULO DO EDITAL","BREVE DESCRIÇÃO DO EDITAL","VALOR TOTAL DO EDITAL","QUANTIDADE DE VAGAS OFERTADAS","Nº DE INSCRITOS","Nº DE NOVOS PONTOS CREDENCIADOS","Nº DE CONTEMPLADOS","A atividade destina recursos para áreas periféricas e/ou de povos tradicionais?","Link da publicação do edital no diário oficial","Observação","LINK DE PUBLICAÇÃO DO CHAMAMENTO/EDITAL","Observação"]
["Premiação de Pontos e Pontões de Cultura","EDITAL DE CHAMAMENTO PÚBLICO Nº. 002/2024 – QUEM SABE FAZ AO VIVO!!! ","Prêmiação de Pontos de Cultura",2200,1,0,0,0,"NÃO","https://www.novabrasilandia.mt.gov.br/fotos_licitacao/1125.pdf"]
[]
[]
[]
[]
[]
[]
[]
[]
[]
[]
[]
[]
[]
[]
[]
[]
[]
[]
[]
[]
[]
[]
[]
[]
[]
[]
[]
[]
[]
[]
[]
[]
[]
[]
[]
[]
[]
[]
[]
[]
[]
[]
[]
[]
[]
[]
[]
[]
[]
[]
[]
[]
[]
[]
[]
[]
[]
[]
[]
[null,null,"Total",{"$f":"SUM(D4:D63)","v":2200},{"$f":"SUM(E4:E63)","v":1},{"$f":"SUM(F4:F63)","v":0},{"$f":"SUM(G4:G63)","v":0},{"$f":"SUM(H4:H63)","v":0}]

{"sheet":"Operacionalização","index":3,"n_rows":94,"n_cols":6,"rows_kept":94,"cut":false,"hidden":false,"merged":[[1,0,1,5],[0,0,0,14]]}
["GOVERNO FEDERAL\nMinistério da Cultura\nPolítica Nacional Aldir Blanc\nPlanilha de Acompanhamento Ciclo 1."]
[{"$f":"CONCATENATE(\"CONTRATAÇÕES PARA OPERACIONALIZAÇÃO DA POLÍTICA - \",UPPER(Informações!A6),\" - \",Informações!C6,\" \",IF(Informações!D6=\"\",\"\",CONCATENATE(\"- CNPJ \",Informações!D6)))","v":"CONTRATAÇÕES PARA OPERACIONALIZAÇÃO DA POLÍTICA - NOVA BRASILÂNDIA - MT - CNPJ 15.023.963/0001-88"}]
["ITEM","DESCRIÇÃO","FORMA DE EXECUÇÃO\n(Selecione um dos itens conforme executado)","VALOR","LINK DE PUBLICAÇÃO DO EXTRATO EM DIÁRIO OFICIAL","Observação"]
["Chamamento público - Fomento à execução de ações culturais - Projeto (Decreto 11.453/2023 e Lei 14.903/2024) ","Serviço ou Profissional Contratado ","Credenciamento (Lei 14.133/2021)",2142.1999999999998,"https://www.novabrasilandia.mt.gov.br/fotos_licitacao/1125.pdf"]
[]
[]
[]
[]
[]
[]
[]
[]
[]
[]
[]
[]
[]
[]
[]
[]
[]
[]
[]
[]
[]
[]
[]
[]
[]
[]
[]
[]
[]
[]
[]
[]
[]
[]
[]
[]
[]
[]
[]
[]
[]
[]
[]
[]
[]
[]
[]
[]
[]
[]
[]
[]
[]
[]
[]
[]
[]
[]
[]
[]
[]
[]
[]
[]
[]
[]
[]
[]
[]
[]
[]
[]
[]
[]
[]
[]
[]
[]
[]
[]
[]
[]
[]
[]
[]
[]
[]
[]
[]
[null,null,"TOTAL",{"$f":"SUM(D4:D93)","v":2142.1999999999998}]

{"sheet":"Lista de Contemplados Geral","index":4,"n_rows":2007,"n_cols":9,"rows_kept":2007,"cut":false,"hidden":false,"merged":[[429,1,429,2],[430,1,430,2],[431,1,431,2],[426,1,426,2],[427,1,427,2],[428,1,428,2],[423,1,423,2],[424,1,424,2],[425,1,425,2],[411,1,411,2],[412,1,412,2],[413,1,413,2],[408,1,408,2],[409,1,409,2],[410,1,410,2],[405,1,405,2],[406,1,406,2],[407,1,407,2],[420,1,420,2],[421,1,421,2],[422,1,422,2],[417,1,417,2],[418,1,418,2],[419,1,419,2],[414,1,414,2],[415,1,415,2],[416,1,416,2],[393,1,393,2],[394,1,394,2],[395,1,395,2],[390,1,390,2],[391,1,391,2],[392,1,392,2],[387,1,387,2],[388,1,388,2],[389,1,389,2],[402,1,402,2],[403,1,403,2],[404,1,404,2],[399,1,399,2],[400,1,400,2],[401,1,401,2],[396,1,396,2],[397,1,397,2],[398,1,398,2],[375,1,375,2],[376,1,376,2],[377,1,377,2],[372,1,372,2],[373,1,373,2],[374,1,374,2],[369,1,369,2],[370,1,370,2],[371,1,371,2],[384,1,384,2],[385,1,385,2],[386,1,386,2],[381,1,381,2],[382,1,382,2],[383,1,383,2],[378,1,378,2],[379,1,379,2],[380,1,380,2],[357,1,357,2],[358,1,358,2],[359,1,359,2],[354,1,354,2],[355,1,355,2],[356,1,356,2],[351,1,351,2],[352,1,352,2],[353,1,353,2],[366,1,366,2],[367,1,367,2],[368,1,368,2],[363,1,363,2],[364,1,364,2],[365,1,365,2],[360,1,360,2],[361,1,361,2],[362,1,362,2],[339,1,339,2],[340,1,340,2],[341,1,341,2],[336,1,336,2],[337,1,337,2],[338,1,338,2],[333,1,333,2],[334,1,334,2],[335,1,335,2],[348,1,348,2],[349,1,349,2],[350,1,350,2],[345,1,345,2],[346,1,346,2],[347,1,347,2],[342,1,342,2],[343,1,343,2],[344,1,344,2],[321,1,321,2],[322,1,322,2],[323,1,323,2],[318,1,318,2],[319,1,319,2],[320,1,320,2],[315,1,315,2],[316,1,316,2],[317,1,317,2],[330,1,330,2],[331,1,331,2],[332,1,332,2],[327,1,327,2],[328,1,328,2],[329,1,329,2],[324,1,324,2],[325,1,325,2],[326,1,326,2],[303,1,303,2],[304,1,304,2],[305,1,305,2],[300,1,300,2],[301,1,301,2],[302,1,302,2],[297,1,297,2],[298,1,298,2],[299,1,299,2],[312,1,312,2],[313,1,313,2],[314,1,314,2],[309,1,309,2],[310,1,310,2],[311,1,311,2],[306,1,306,2],[307,1,307,2],[308,1,308,2],[285,1,285,2],[286,1,286,2],[287,1,287,2],[282,1,282,2],[283,1,283,2],[284,1,284,2],[279,1,279,2],[280,1,280,2],[281,1,281,2],[294,1,294,2],[295,1,295,2],[296,1,296,2],[291,1,291,2],[292,1,292,2],[293,1,293,2],[288,1,288,2],[289,1,289,2],[290,1,290,2],[267,1,267,2],[268,1,268,2],[269,1,269,2],[264,1,264,2],[265,1,265,2],[266,1,266,2],[261,1,261,2],[262,1,262,2],[263,1,263,2],[276,1,276,2],[277,1,277,2],[278,1,278,2],[273,1,273,2],[274,1,274,2],[275,1,275,2],[270,1,270,2],[271,1,271,2],[272,1,272,2],[249,1,249,2],[250,1,250,2],[251,1,251,2],[246,1,246,2],[247,1,247,2],[248,1,248,2],[243,1,243,2],[244,1,244,2],[245,1,245,2],[258,1,258,2],[259,1,259,2],[260,1,260,2],[255,1,255,2],[256,1,256,2],[257,1,257,2],[252,1,252,2],[253,1,253,2],[254,1,254,2],[231,1,231,2],[232,1,232,2],[233,1,233,2],[228,1,228,2],[229,1,229,2],[230,1,230,2],[225,1,225,2],[226,1,226,2],[227,1,227,2],[240,1,240,2],[241,1,241,2],[242,1,242,2],[237,1,237,2],[238,1,238,2],[239,1,239,2],[234,1,234,2],[235,1,235,2],[236,1,236,2],[213,1,213,2],[214,1,214,2],[215,1,215,2],[210,1,210,2],[211,1,211,2],[212,1,212,2],[207,1,207,2],[208,1,208,2],[209,1,209,2],[222,1,222,2],[223,1,223,2],[224,1,224,2],[219,1,219,2],[220,1,220,2],[221,1,221,2],[216,1,216,2],[217,1,217,2],[218,1,218,2],[195,1,195,2],[196,1,196,2],[197,1,197,2],[192,1,192,2],[193,1,193,2],[194,1,194,2],[189,1,189,2],[190,1,190,2],[191,1,191,2],[204,1,204,2],[205,1,205,2],[206,1,206,2],[201,1,201,2],[202,1,202,2],[203,1,203,2],[198,1,198,2],[199,1,199,2],[200,1,200,2],[177,1,177,2],[178,1,178,2],[179,1,179,2],[174,1,174,2],[175,1,175,2],[176,1,176,2],[171,1,171,2],[172,1,172,2],[173,1,173,2],[186,1,186,2],[187,1,187,2],[188,1,188,2],[183,1,183,2],[184,1,184,2],[185,1,185,2],[180,1,180,2],[181,1,181,2],[182,1,182,2],[159,1,159,2],[160,1,160,2],[161,1,161,2],[156,1,156,2],[157,1,157,2],[158,1,158,2],[153,1,153,2],[154,1,154,2],[155,1,155,2],[168,1,168,2],[169,1,169,2],[170,1,170,2],[165,1,165,2],[166,1,166,2],[167,1,167,2],[162,1,162,2],[163,1,163,2],[164,1,164,2],[141,1,141,2],[142,1,142,2],[143,1,143,2],[138,1,138,2],[139,1,139,2],[140,1,140,2],[135,1,135,2],[136,1,136,2],[137,1,137,2],[150,1,150,2],[151,1,151,2],[152,1,152,2],[147,1,147,2],[148,1,148,2],[149,1,149,2],[144,1,144,2],[145,1,145,2],[146,1,146,2],[123,1,123,2],[124,1,124,2],[125,1,125,2],[120,1,120,2],[121,1,121,2],[122,1,122,2],[117,1,117,2],[118,1,118,2],[119,1,119,2],[132,1,132,2],[133,1,133,2],[134,1,134,2],[129,1,129,2],[130,1,130,2],[131,1,131,2],[126,1,126,2],[127,1,127,2],[128,1,128,2],[105,1,105,2],[106,1,106,2],[107,1,107,2],[102,1,102,2],[103,1,103,2],[104,1,104,2],[99,1,99,2],[100,1,100,2],[101,1,101,2],[114,1,114,2],[115,1,115,2],[116,1,116,2],[111,1,111,2],[112,1,112,2],[113,1,113,2],[108,1,108,2],[109,1,109,2],[110,1,110,2],[87,1,87,2],[88,1,88,2],[89,1,89,2],[84,1,84,2],[85,1,85,2],[86,1,86,2],[81,1,81,2],[82,1,82,2],[83,1,83,2],[96,1,96,2],[97,1,97,2],[98,1,98,2],[93,1,93,2],[94,1,94,2],[95,1,95,2],[90,1,90,2],[91,1,91,2],[92,1,92,2],[69,1,69,2],[70,1,70,2],[71,1,71,2],[44,1,44,2],[45,1,45,2],[68,1,68,2],[41,1,41,2],[42,1,42,2],[43,1,43,2],[78,1,78,2],[79,1,79,2],[80,1,80,2],[75,1,75,2],[76,1,76,2],[77,1,77,2],[72,1,72,2],[73,1,73,2],[74,1,74,2],[29,1,29,2],[30,1,30,2],[31,1,31,2],[26,1,26,2],[27,1,27,2],[28,1,28,2],[24,1,24,2],[25,1,25,2],[38,1,38,2],[39,1,39,2],[40,1,40,2],[35,1,35,2],[36,1,36,2],[37,1,37,2],[32,1,32,2],[33,1,33,2],[34,1,34,2],[14,1,14,2],[432,1,432,2],[433,1,433,2],[434,1,434,2],[435,1,435,2],[436,1,436,2],[437,1,437,2],[438,1,438,2],[439,1,439,2],[440,1,440,2],[0,0,0,6],[0,9,2006,9],[2,1,2,2],[450,1,450,2],[451,1,451,2],[452,1,452,2],[453,1,453,2],[454,1,454,2],[455,1,455,2],[456,1,456,2],[457,1,457,2],[458,1,458,2],[441,1,441,2],[442,1,442,2],[443,1,443,2],[444,1,444,2],[445,1,445,2],[446,1,446,2],[447,1,447,2],[448,1,448,2],[449,1,449,2],[468,1,468,2],[469,1,469,2],[470,1,470,2],[471,1,471,2],[472,1,472,2],[473,1,473,2],[474,1,474,2],[475,1,475,2],[476,1,476,2],[459,1,459,2],[460,1,460,2],[461,1,461,2],[462,1,462,2],[463,1,463,2],[464,1,464,2],[465,1,465,2],[466,1,466,2],[467,1,467,2],[486,1,486,2],[487,1,487,2],[488,1,488,2],[489,1,489,2],[490,1,490,2],[491,1,491,2],[492,1,492,2],[493,1,493,2],[494,1,494,2],[477,1,477,2],[478,1,478,2],[479,1,479,2],[480,1,480,2],[481,1,481,2],[482,1,482,2],[483,1,483,2],[484,1,484,2],[485,1,485,2],[504,1,504,2],[505,1,505,2],[506,1,506,2],[507,1,507,2],[508,1,508,2],[509,1,509,2],[510,1,510,2],[511,1,511,2],[512,1,512,2],[495,1,495,2],[496,1,496,2],[497,1,497,2],[498,1,498,2],[499,1,499,2],[500,1,500,2],[501,1,501,2],[502,1,502,2],[503,1,503,2],[522,1,522,2],[523,1,523,2],[524,1,524,2],[525,1,525,2],[526,1,526,2],[527,1,527,2],[528,1,528,2],[529,1,529,2],[530,1,530,2],[513,1,513,2],[514,1,514,2],[515,1,515,2],[516,1,516,2],[517,1,517,2],[518,1,518,2],[519,1,519,2],[520,1,520,2],[521,1,521,2],[540,1,540,2],[541,1,541,2],[542,1,542,2],[543,1,543,2],[544,1,544,2],[545,1,545,2],[546,1,546,2],[547,1,547,2],[548,1,548,2],[531,1,531,2],[532,1,532,2],[533,1,533,2],[534,1,534,2],[535,1,535,2],[536,1,536,2],[537,1,537,2],[538,1,538,2],[539,1,539,2],[558,1,558,2],[559,1,559,2],[560,1,560,2],[561,1,561,2],[562,1,562,2],[563,1,563,2],[564,1,564,2],[565,1,565,2],[566,1,566,2],[549,1,549,2],[550,1,550,2],[551,1,551,2],[552,1,552,2],[553,1,553,2],[554,1,554,2],[555,1,555,2],[556,1,556,2],[557,1,557,2],[576,1,576,2],[577,1,577,2],[578,1,578,2],[579,1,579,2],[580,1,580,2],[581,1,581,2],[582,1,582,2],[583,1,583,2],[584,1,584,2],[567,1,567,2],[568,1,568,2],[569,1,569,2],[570,1,570,2],[571,1,571,2],[572,1,572,2],[573,1,573,2],[574,1,574,2],[575,1,575,2],[594,1,594,2],[595,1,595,2],[596,1,596,2],[597,1,597,2],[598,1,598,2],[599,1,599,2],[600,1,600,2],[601,1,601,2],[602,1,602,2],[585,1,585,2],[586,1,586,2],[587,1,587,2],[588,1,588,2],[589,1,589,2],[590,1,590,2],[591,1,591,2],[592,1,592,2],[593,1,593,2],[612,1,612,2],[613,1,613,2],[614,1,614,2],[615,1,615,2],[616,1,616,2],[617,1,617,2],[618,1,618,2],[619,1,619,2],[620,1,620,2],[603,1,603,2],[604,1,604,2],[605,1,605,2],[606,1,606,2],[607,1,607,2],[608,1,608,2],[609,1,609,2],[610,1,610,2],[611,1,611,2],[630,1,630,2],[631,1,631,2],[632,1,632,2],[633,1,633,2],[634,1,634,2],[635,1,635,2],[636,1,636,2],[637,1,637,2],[638,1,638,2],[621,1,621,2],[622,1,622,2],[623,1,623,2],[624,1,624,2],[625,1,625,2],[626,1,626,2],[627,1,627,2],[628,1,628,2],[629,1,629,2],[648,1,648,2],[649,1,649,2],[650,1,650,2],[651,1,651,2],[652,1,652,2],[653,1,653,2],[654,1,654,2],[655,1,655,2],[656,1,656,2],[639,1,639,2],[640,1,640,2],[641,1,641,2],[642,1,642,2],[643,1,643,2],[644,1,644,2],[645,1,645,2],[646,1,646,2],[647,1,647,2],[666,1,666,2],[667,1,667,2],[668,1,668,2],[669,1,669,2],[670,1,670,2],[671,1,671,2],[672,1,672,2],[673,1,673,2],[674,1,674,2],[657,1,657,2],[658,1,658,2],[659,1,659,2],[660,1,660,2],[661,1,661,2],[662,1,662,2],[663,1,663,2],[664,1,664,2],[665,1,665,2],[684,1,684,2],[685,1,685,2],[686,1,686,2],[687,1,687,2],[688,1,688,2],[689,1,689,2],[690,1,690,2],[691,1,691,2],[692,1,692,2],[675,1,675,2],[676,1,676,2],[677,1,677,2],[678,1,678,2],[679,1,679,2],[680,1,680,2],[681,1,681,2],[682,1,682,2],[683,1,683,2],[702,1,702,2],[703,1,703,2],[704,1,704,2],[705,1,705,2],[706,1,706,2],[707,1,707,2],[708,1,708,2],[709,1,709,2],[710,1,710,2],[693,1,693,2],[694,1,694,2],[695,1,695,2],[696,1,696,2],[697,1,697,2],[698,1,698,2],[699,1,699,2],[700,1,700,2],[701,1,701,2],[720,1,720,2],[721,1,721,2],[722,1,722,2],[723,1,723,2],[724,1,724,2],[725,1,725,2],[726,1,726,2],[727,1,727,2],[728,1,728,2],[711,1,711,2],[712,1,712,2],[713,1,713,2],[714,1,714,2],[715,1,715,2],[716,1,716,2],[717,1,717,2],[718,1,718,2],[719,1,719,2],[738,1,738,2],[739,1,739,2],[740,1,740,2],[741,1,741,2],[742,1,742,2],[743,1,743,2],[744,1,744,2],[745,1,745,2],[746,1,746,2],[729,1,729,2],[730,1,730,2],[731,1,731,2],[732,1,732,2],[733,1,733,2],[734,1,734,2],[735,1,735,2],[736,1,736,2],[737,1,737,2],[756,1,756,2],[757,1,757,2],[758,1,758,2],[759,1,759,2],[760,1,760,2],[761,1,761,2],[762,1,762,2],[763,1,763,2],[764,1,764,2],[747,1,747,2],[748,1,748,2],[749,1,749,2],[750,1,750,2],[751,1,751,2],[752,1,752,2],[753,1,753,2],[754,1,754,2],[755,1,755,2],[774,1,774,2],[775,1,775,2],[776,1,776,2],[777,1,777,2],[778,1,778,2],[779,1,779,2],[780,1,780,2],[781,1,781,2],[782,1,782,2],[765,1,765,2],[766,1,766,2],[767,1,767,2],[768,1,768,2],[769,1,769,2],[770,1,770,2],[771,1,771,2],[772,1,772,2],[773,1,773,2],[792,1,792,2],[793,1,793,2],[794,1,794,2],[795,1,795,2],[796,1,796,2],[797,1,797,2],[798,1,798,2],[799,1,799,2],[800,1,800,2],[783,1,783,2],[784,1,784,2],[785,1,785,2],[786,1,786,2],[787,1,787,2],[788,1,788,2],[789,1,789,2],[790,1,790,2],[791,1,791,2],[810,1,810,2],[811,1,811,2],[812,1,812,2],[813,1,813,2],[814,1,814,2],[815,1,815,2],[816,1,816,2],[817,1,817,2],[818,1,818,2],[801,1,801,2],[802,1,802,2],[803,1,803,2],[804,1,804,2],[805,1,805,2],[806,1,806,2],[807,1,807,2],[808,1,808,2],[809,1,809,2],[828,1,828,2],[829,1,829,2],[830,1,830,2],[831,1,831,2],[832,1,832,2],[833,1,833,2],[834,1,834,2],[835,1,835,2],[836,1,836,2],[819,1,819,2],[820,1,820,2],[821,1,821,2],[822,1,822,2],[823,1,823,2],[824,1,824,2],[825,1,825,2],[826,1,826,2],[827,1,827,2],[846,1,846,2],[847,1,847,2],[848,1,848,2],[849,1,849,2],[850,1,850,2],[851,1,851,2],[852,1,852,2],[853,1,853,2],[854,1,854,2],[837,1,837,2],[838,1,838,2],[839,1,839,2],[840,1,840,2],[841,1,841,2],[842,1,842,2],[843,1,843,2],[844,1,844,2],[845,1,845,2],[864,1,864,2],[865,1,865,2],[866,1,866,2],[867,1,867,2],[868,1,868,2],[869,1,869,2],[870,1,870,2],[871,1,871,2],[872,1,872,2],[855,1,855,2],[856,1,856,2],[857,1,857,2],[858,1,858,2],[859,1,859,2],[860,1,860,2],[861,1,861,2],[862,1,862,2],[863,1,863,2],[882,1,882,2],[883,1,883,2],[884,1,884,2],[885,1,885,2],[886,1,886,2],[887,1,887,2],[888,1,888,2],[889,1,889,2],[890,1,890,2],[873,1,873,2],[874,1,874,2],[875,1,875,2],[876,1,876,2],[877,1,877,2],[878,1,878,2],[879,1,879,2],[880,1,880,2],[881,1,881,2],[900,1,900,2],[901,1,901,2],[902,1,902,2],[903,1,903,2],[904,1,904,2],[905,1,905,2],[906,1,906,2],[907,1,907,2],[908,1,908,2],[891,1,891,2],[892,1,892,2],[893,1,893,2],[894,1,894,2],[895,1,895,2],[896,1,896,2],[897,1,897,2],[898,1,898,2],[899,1,899,2],[918,1,918,2],[919,1,919,2],[920,1,920,2],[921,1,921,2],[922,1,922,2],[923,1,923,2],[924,1,924,2],[925,1,925,2],[926,1,926,2],[909,1,909,2],[910,1,910,2],[911,1,911,2],[912,1,912,2],[913,1,913,2],[914,1,914,2],[915,1,915,2],[916,1,916,2],[917,1,917,2],[936,1,936,2],[937,1,937,2],[938,1,938,2],[939,1,939,2],[940,1,940,2],[941,1,941,2],[942,1,942,2],[943,1,943,2],[944,1,944,2],[927,1,927,2],[928,1,928,2],[929,1,929,2],[930,1,930,2],[931,1,931,2],[932,1,932,2],[933,1,933,2],[934,1,934,2],[935,1,935,2],[954,1,954,2],[955,1,955,2],[956,1,956,2],[957,1,957,2],[958,1,958,2],[959,1,959,2],[960,1,960,2],[961,1,961,2],[962,1,962,2],[945,1,945,2],[946,1,946,2],[947,1,947,2],[948,1,948,2],[949,1,949,2],[950,1,950,2],[951,1,951,2],[952,1,952,2],[953,1,953,2],[972,1,972,2],[973,1,973,2],[974,1,974,2],[975,1,975,2],[976,1,976,2],[977,1,977,2],[978,1,978,2],[979,1,979,2],[980,1,980,2],[963,1,963,2],[964,1,964,2],[965,1,965,2],[966,1,966,2],[967,1,967,2],[968,1,968,2],[969,1,969,2],[970,1,970,2],[971,1,971,2],[990,1,990,2],[991,1,991,2],[992,1,992,2],[993,1,993,2],[994,1,994,2],[995,1,995,2],[996,1,996,2],[997,1,997,2],[998,1,998,2],[981,1,981,2],[982,1,982,2],[983,1,983,2],[984,1,984,2],[985,1,985,2],[986,1,986,2],[987,1,987,2],[988,1,988,2],[989,1,989,2],[1008,1,1008,2],[1009,1,1009,2],[1010,1,1010,2],[1011,1,1011,2],[1012,1,1012,2],[1013,1,1013,2],[1014,1,1014,2],[1015,1,1015,2],[1016,1,1016,2],[999,1,999,2],[1000,1,1000,2],[1001,1,1001,2],[1002,1,1002,2],[1003,1,1003,2],[1004,1,1004,2],[1005,1,1005,2],[1006,1,1006,2],[1007,1,1007,2],[1026,1,1026,2],[1027,1,1027,2],[1028,1,1028,2],[1029,1,1029,2],[1030,1,1030,2],[1031,1,1031,2],[1032,1,1032,2],[1033,1,1033,2],[1034,1,1034,2],[1017,1,1017,2],[1018,1,1018,2],[1019,1,1019,2],[1020,1,1020,2],[1021,1,1021,2],[1022,1,1022,2],[1023,1,1023,2],[1024,1,1024,2],[1025,1,1025,2],[1044,1,1044,2],[1045,1,1045,2],[1046,1,1046,2],[1047,1,1047,2],[1048,1,1048,2],[1049,1,1049,2],[1050,1,1050,2]],"merged_total":1964,"flags":["merged_cut"]}
["GOVERNO FEDERAL\nMinistério da Cultura\nPolítica Nacional Aldir Blanc\nPlanilha de Acompanhamento Ciclo 1."]
[{"$f":"CONCATENATE(\"LISTA DE BENEFICIÁRIOS DOS EDITAIS DE FOMENTO, PARCERIAS, CONTRATOS DAS AÇÕES CULTURAIS E DAS DESPESAS COM OPERACIONALIZAÇÃO - \",UPPER(Informações!A6),\" - \",Informações!C6,\" \",CONCATENATE(\"- CNPJ \",Informações!D6))","v":"LISTA DE BENEFICIÁRIOS DOS EDITAIS DE FOMENTO, PARCERIAS, CONTRATOS DAS AÇÕES CULTURAIS E DAS DESPESAS COM OPERACIONALIZAÇÃO - NOVA BRASILÂNDIA - MT - CNPJ 15.023.963/0001-88"}]
["Nome da Atividade preenchida em Ações gerais e Operacionalização","Nome do (a) contemplado (a) via fomento ou\ncontratado via licitação e contrato",null,"CPF (anonimizado)","CNPJ","Nome do Projeto \n(apenas para editais de fomento)","Link da Publicação da Lista de Contemplados \n(apenas para editais de fomento)","Valor Pago ao contemplado ou contratado","Observação"]
["Edital de Premiação de Artista da Música \nGospel e Sertaneja. (Mostra  de Música)","GENILSON MENDES ARAUJO",null,"***857102**",null,"QUEM SABE FAZ AO VIVO!!! ","https://amm.diariomunicipal.org/publicacao/1526652/",1203.18]
[null,"DANIELY ESTER CANDIDO DA COSTA",null,"***335152**",null,"QUEM SABE FAZ AO VIVO!!! ","https://amm.diariomunicipal.org/publicacao/1526652/",1203.18]
["EDITAL DE FOMENTO CULTURAL 002/2024","LEONNA ELOA DOS REIS SOUZA",null,"***211160**",null,"QUEM SABE FAZ AO VIVO!!! ","https://amm.diariomunicipal.org/publicacao/1526652/",1203.18]
["EDITAL DE FOMENTO CULTURAL 002/2024","VALENTINA FOGAÇA SILVA",null,"***978132**",null,"QUEM SABE FAZ AO VIVO!!! ","https://amm.diariomunicipal.org/publicacao/1526652/",1203.18]
["EDITAL DE FOMENTO CULTURAL 002/2024","FLORISVALDO MARQUES DOS SANTOS",null,"***670120**",null,"QUEM SABE FAZ AO VIVO!!! ","https://amm.diariomunicipal.org/publicacao/1526652/",1203.18]
["EDITAL DE FOMENTO CULTURAL 002/2024",null,null,null,null,"QUEM SABE FAZ AO VIVO!!! ","https://amm.diariomunicipal.org/publicacao/1526652/",1203.18]
["EDITAL DE FOMENTO CULTURAL 002/2024","ELAINE DOS REIS SANTOS",null,"***248180**",null,"QUEM SABE FAZ AO VIVO!!! ","https://amm.diariomunicipal.org/publicacao/1526652/",1203.18]
["EDITAL DE FOMENTO CULTURAL 002/2024","LUCIANA FERREIRA SANTOS CARVALHO",null,"***113164**",null,"QUEM SABE FAZ AO VIVO!!! ","https://amm.diariomunicipal.org/publicacao/1526652/",1203.18]
["EDITAL DE FOMENTO CULTURAL 002/2024","FLAVIO DOS SANTOS SILVA",null,"***742133**",null,"QUEM SABE FAZ AO VIVO!!! ","https://amm.diariomunicipal.org/publicacao/1526652/",1203.18]
["EDITAL DE FOMENTO CULTURAL 002/2024","FRANCIELI NUNES POQUIVIQUI",null,"***093177**",null,"QUEM SABE FAZ AO VIVO!!! ","https://amm.diariomunicipal.org/publicacao/1526652/",1203.18]
["EDITAL DE FOMENTO CULTURAL 002/2024","MARCILENE GERVASIO PINHEIRO",null,"***858168**",null,"QUEM SABE FAZ AO VIVO!!! ","https://amm.diariomunicipal.org/publicacao/1526652/",1203.18]
["Chamamento público - Fomento à execução de ações culturais - Projeto (Decreto 11.453/2023 e Lei 14.903/2024) ","GENILSON MENDES ARAUJO",null,"***857102**",null,"QUEM SABE FAZ AO VIVO!!! ","https://amm.diariomunicipal.org/publicacao/1526652/",1203.18]
["Chamamento público - Fomento à execução de ações culturais - Projeto (Decreto 11.453/2023 e Lei 14.903/2024) ","DANIELY ESTER CANDIDO DA COSTA",null,"***335152**",null,"QUEM SABE FAZ AO VIVO!!! ","https://amm.diariomunicipal.org/publicacao/1526652/",1203.18]
["Chamamento público - Fomento à execução de ações culturais - Projeto (Decreto 11.453/2023 e Lei 14.903/2024) ","LEONNA ELOA DOS REIS SOUZA",null,"***211160**",null,"QUEM SABE FAZ AO VIVO!!! ","https://amm.diariomunicipal.org/publicacao/1526652/",1203.18]
["Chamamento público - Fomento à execução de ações culturais - Projeto (Decreto 11.453/2023 e Lei 14.903/2024) ","VALENTINA FOGAÇA SILVA",null,"***978132**",null,"QUEM SABE FAZ AO VIVO!!! ","https://amm.diariomunicipal.org/publicacao/1526652/",1203.18]
["Chamamento público - Fomento à execução de ações culturais - Projeto (Decreto 11.453/2023 e Lei 14.903/2024) ","FLORISVALDO MARQUES DOS SANTOS",null,"***670120**",null,"QUEM SABE FAZ AO VIVO!!! ","https://amm.diariomunicipal.org/publicacao/1526652/",1203.18]
["Chamamento público - Fomento à execução de ações culturais - Projeto (Decreto 11.453/2023 e Lei 14.903/2024) ","ELAINE DOS REIS SANTOS",null,"***248180**",null,"QUEM SABE FAZ AO VIVO!!! ","https://amm.diariomunicipal.org/publicacao/1526652/",1203.18]
["Chamamento público - Fomento à execução de ações culturais - Projeto (Decreto 11.453/2023 e Lei 14.903/2024) ","LUCIANA FERREIRA SANTOS CARVALHO",null,"***113164**",null,"QUEM SABE FAZ AO VIVO!!! ","https://amm.diariomunicipal.org/publicacao/1526652/",1203.18]
["Chamamento público - Fomento à execução de ações culturais - Projeto (Decreto 11.453/2023 e Lei 14.903/2024) ","FLAVIO DOS SANTOS SILVA",null,"***742133**",null,"QUEM SABE FAZ AO VIVO!!! ","https://amm.diariomunicipal.org/publicacao/1526652/",1203.18]
["Chamamento público - Fomento à execução de ações culturais - Projeto (Decreto 11.453/2023 e Lei 14.903/2024) ","FRANCIELI NUNES POQUIVIQUI",null,"***093177**",null,"QUEM SABE FAZ AO VIVO!!! ","https://amm.diariomunicipal.org/publicacao/1526652/",1203.18]
["Chamamento público - Fomento à execução de ações culturais - Projeto (Decreto 11.453/2023 e Lei 14.903/2024) ","EDEJAINE GABLINNY BORGES PORTO",null,"***829139**",null,"QUEM SABE FAZ AO VIVO!!! ","https://amm.diariomunicipal.org/publicacao/1526652/",1203.18]
["Chamamento público - Fomento à execução de ações culturais - Projeto (Decreto 11.453/2023 e Lei 14.903/2024) ","AMANDA RODRIGUES NEVES",null,"***974112**",null,"QUEM SABE FAZ AO VIVO!!! ","https://amm.diariomunicipal.org/publicacao/1526652/",1203.18]
["Chamamento público - Fomento à execução de ações culturais - Projeto (Decreto 11.453/2023 e Lei 14.903/2024) ","MARCILENE GERVASIO PINHEIRO",null,"***858168**",null,"QUEM SABE FAZ AO VIVO!!! ","https://amm.diariomunicipal.org/publicacao/1526652/",1203.18]
["Chamamento público - Fomento à execução de ações culturais - Projeto (Decreto 11.453/2023 e Lei 14.903/2024) ","MARIA SEBASTIANA DE ALMEIDA",null,"***420107**",null,"QUEM SABE FAZ AO VIVO!!! ","https://amm.diariomunicipal.org/publicacao/1526652/",1203.18]
["Chamamento público - Fomento à execução de ações culturais - Projeto (Decreto 11.453/2023 e Lei 14.903/2024) ","ALZIRA ROSA DA SILVA",null,"***075549**",null,"QUEM SABE FAZ AO VIVO!!! ","https://amm.diariomunicipal.org/publicacao/1526652/",1203.18]
["Chamamento público - Fomento à execução de ações culturais - Projeto (Decreto 11.453/2023 e Lei 14.903/2024) ","ROSANGELA DE MORAIS LEMES",null,"***769182**",null,"QUEM SABE FAZ AO VIVO!!! ","https://amm.diariomunicipal.org/publicacao/1526652/",1203.18]
["Chamamento público - Fomento à execução de ações culturais - Projeto (Decreto 11.453/2023 e Lei 14.903/2024) ","JOSEFA MARIA DA SILVA",null,"***763183**",null,"QUEM SABE FAZ AO VIVO!!! ","https://amm.diariomunicipal.org/publicacao/1526652/",1203.18]
["Chamamento público - Fomento à execução de ações culturais - Projeto (Decreto 11.453/2023 e Lei 14.903/2024) ","DELISMAR SOARES PEREIRA",null,"***954180**",null,"QUEM SABE FAZ AO VIVO!!! ","https://amm.diariomunicipal.org/publicacao/1526652/",1203.18]
["Chamamento público - Fomento à execução de ações culturais - Projeto (Decreto 11.453/2023 e Lei 14.903/2024) ","VANESSA ELOI ROCHA",null,"***070388**",null,"QUEM SABE FAZ AO VIVO!!! ","https://amm.diariomunicipal.org/publicacao/1526652/",1203.18]
["Chamamento público - Fomento à execução de ações culturais - Projeto (Decreto 11.453/2023 e Lei 14.903/2024) ","ZELINA NEVES DA PURIFICAÇÃO",null,"***024134**",null,"QUEM SABE FAZ AO VIVO!!! ","https://amm.diariomunicipal.org/publicacao/1526652/",1203.18]
["Chamamento público - Fomento à execução de ações culturais - Projeto (Decreto 11.453/2023 e Lei 14.903/2024) ","JAQUELINE TELES DOS SANTOS",null,"***579159**",null,"QUEM SABE FAZ AO VIVO!!! ","https://amm.diariomunicipal.org/publicacao/1526652/",1203.18]
["Chamamento público - Fomento à execução de ações culturais - Projeto (Decreto 11.453/2023 e Lei 14.903/2024) ","LEILA GONÇALINA DE ALMEIDA SANTOS",null,"***246144**",null,"QUEM SABE FAZ AO VIVO!!! ","https://amm.diariomunicipal.org/publicacao/1526652/",1203.18]
["Chamamento público - Fomento à execução de ações culturais - Projeto (Decreto 11.453/2023 e Lei 14.903/2024) "," MARIA MARGARETH GOMES DA SILVA",null,"***842168**",null,"QUEM SABE FAZ AO VIVO!!! ","https://amm.diariomunicipal.org/publicacao/1526652/",1203.18]
["Chamamento público - Fomento à execução de ações culturais - Projeto (Decreto 11.453/2023 e Lei 14.903/2024) ","LEUZITA NEVES SEGUNDO NOVAIS",null,"***630197**",null,"QUEM SABE FAZ AO VIVO!!! ","https://amm.diariomunicipal.org/publicacao/1526652/",1203.18]
["Chamamento público - Fomento à execução de ações culturais - Projeto (Decreto 11.453/2023 e Lei 14.903/2024) ","IRAIDES RUFINO DA SILVA FERREIRA",null,"***150125**",null,"QUEM SABE FAZ AO VIVO!!! ","https://amm.diariomunicipal.org/publicacao/1526652/",1203.18]
["Chamamento público - Fomento à execução de ações culturais - Projeto (Decreto 11.453/2023 e Lei 14.903/2024) "," DEBORA HELEN FERREIRA DA SILVA",null,"***157155**",null,"QUEM SABE FAZ AO VIVO!!! ","https://amm.diariomunicipal.org/publicacao/1526652/",1203.18]
["Chamamento público - Fomento à execução de ações culturais - Projeto (Decreto 11.453/2023 e Lei 14.903/2024) ","TARCISIO FELIPE DE SOUZA VENTURA",null,"***186181**",null,"QUEM SABE FAZ AO VIVO!!! ","https://amm.diariomunicipal.org/publicacao/1526652/",1203.18]
["Chamamento público - Fomento à execução de ações culturais - Projeto (Decreto 11.453/2023 e Lei 14.903/2024) ","ADRIEL RODRIGUES DOS SANTOS",null,"***198188**",null,"QUEM SABE FAZ AO VIVO!!! ","https://amm.diariomunicipal.org/publicacao/1526652/",1203.18]
["Chamamento público - Fomento à execução de ações culturais - Projeto (Decreto 11.453/2023 e Lei 14.903/2024) ","TÂNIA MARIA BONFIM LOPES FERNANDA",null,"***434187**",null,"QUEM SABE FAZ AO VIVO!!! ","https://amm.diariomunicipal.org/publicacao/1526652/",1203.18]
["Chamamento público - Fomento à execução de ações culturais - Projeto (Decreto 11.453/2023 e Lei 14.903/2024) ","MARIA APARECIDA DE OLIVEIRA",null,"***900100**",null,"QUEM SABE FAZ AO VIVO!!! ","https://amm.diariomunicipal.org/publicacao/1526652/",1203.18]
["Chamamento público - Fomento à execução de ações culturais - Projeto (Decreto 11.453/2023 e Lei 14.903/2024) ","GABRYENE FLAVINY BORGES PORTO",null,"***877109**",null,"QUEM SABE FAZ AO VIVO!!! ","https://amm.diariomunicipal.org/publicacao/1526652/",1203.18]
["Chamamento público - Fomento à execução de ações culturais - Projeto (Decreto 11.453/2023 e Lei 14.903/2024) ","MEIRIANE ANASTACIA DE SOUZA",null,"***013143**",null,"QUEM SABE FAZ AO VIVO!!! ","https://amm.diariomunicipal.org/publicacao/1526652/",1203.18]
["Chamamento público - Fomento à execução de ações culturais - Projeto (Decreto 11.453/2023 e Lei 14.903/2024) ","EVA NUNES VIEIRA",null,"***500106**",null,"QUEM SABE FAZ AO VIVO!!! ","https://amm.diariomunicipal.org/publicacao/1526652/",1203.18]
[]
[]
[]
[]
[]
[]
[]
[]
[]
[]
[]
[]
[]
[]
[]
[]
[]
[]
[]
[]
[]
[]
[]
[]
[]
[]
[]
[]
[]
[]
[]
[]
[]
[]
[]
[]
[]
[]
[]
[]
[]
[]
[]
[]
[]
[]
[]
[]
[]
[]
[]
[]
[]
[]
[]
[]
[]
[]
[]
[]
[]
[]
[]
[]
[]
[]
[]
[]
[]
[]
[]
[]
[]
[]
[]
[]
[]
[]
[]
[]
[]
[]
[]
[]
[]
[]
[]
[]
[]
[]
[]
[]
[]
[]
[]
[]
[]
[]
[]
[]
[]
[]
[]
[]
[]
[]
[]
[]
[]
[]
[]
[]
[]
[]
[]
[]
[]
[]
[]
[]
[]
[]
[]
[]
[]
[]
[]
[]
[]
[]
[]
[]
[]
[]
[]
[]
[]
[]
[]
[]
[]
[]
[]
[]
[]
[]
[]
[]
[]
[]
[]
[]
[]
[]
[]
[]
[]
[]
[]
[]
[]
[]
[]
[]
[]
[]
[]
[]
[]
[]
[]
[]
[]
[]
[]
[]
[]
[]
[]
[]
[]
[]
[]
[]
[]
[]
[]
[]
[]
[]
[]
[]
[]
[]
[]
[]
[]
[]
[]
[]
[]
[]
[]
[]
[]
[]
[]
[]
[]
[]
[]
[]
[]
[]
[]
[]
[]
[]
[]
[]
[]
[]
[]
[]
[]
[]
[]
[]
[]
[]
[]
[]
[]
[]
[]
[]
[]
[]
[]
[]
[]
[]
[]
[]
[]
[]
[]
[]
[]
[]
[]
[]
[]
[]
[]
[]
[]
[]
[]
[]
[]
[]
[]
[]
[]
[]
[]
[]
[]
[]
[]
[]
[]
[]
[]
[]
[]
[]
[]
[]
[]
[]
[]
[]
[]
[]
[]
[]
[]
[]
[]
[]
[]
[]
[]
[]
[]
[]
[]
[]
[]
[]
[]
[]
[]
[]
[]
[]
[]
[]
[]
[]
[]
[]
[]
[]
[]
[]
[]
[]
[]
[]
[]
[]
[]
[]
[]
[]
[]
[]
[]
[]
[]
[]
[]
[]
[]
[]
[]
[]
[]
[]
[]
[]
[]
[]
[]
[]
[]
[]
[]
[]
[]
[]
[]
[]
[]
[]
[]
[]
[]
[]
[]
[]
[]
[]
[]
[]
[]
[]
[]
[]
[]
[]
[]
[]
[]
[]
[]
[]
[]
[]
[]
[]
[]
[]
[]
[]
[]
[]
[]
[]
[]
[]
[]
[]
[]
[]
[]
[]
[]
[]
[]
[]
[]
[]
[]
[]
[]
[]
[]
[]
[]
[]
[]
[]
[]
[]
[]
[]
[]
[]
[]
[]
[]
[]
[]
[]
[]
[]
[]
[]
[]
[]
[]
[]
[]
[]
[]
[]
[]
[]
[]
[]
[]
[]
[]
[]
[]
[]
[]
[]
[]
[]
[]
[]
[]
[]
[]
[]
[]
[]
[]
[]
[]
[]
[]
[]
[]
[]
[]
[]
[]
[]
[]
[]
[]
[]
[]
[]
[]
[]
[]
[]
[]
[]
[]
[]
[]
[]
[]
[]
[]
[]
[]
[]
[]
[]
[]
[]
[]
[]
[]
[]
[]
[]
[]
[]
[]
[]
[]
[]
[]
[]
[]
[]
[]
[]
[]
[]
[]
[]
[]
[]
[]
[]
[]
[]
[]
[]
[]
[]
[]
[]
[]
[]
[]
[]
[]
[]
[]
[]
[]
[]
[]
[]
[]
[]
[]
[]
[]
[]
[]
[]
[]
[]
[]
[]
[]
[]
[]
[]
[]
[]
[]
[]
[]
[]
[]
[]
[]
[]
[]
[]
[]
[]
[]
[]
[]
[]
[]
[]
[]
[]
[]
[]
[]
[]
[]
[]
[]
[]
[]
[]
[]
[]
[]
[]
[]
[]
[]
[]
[]
[]
[]
[]
[]
[]
[]
[]
[]
[]
[]
[]
[]
[]
[]
[]
[]
[]
[]
[]
[]
[]
[]
[]
[]
[]
[]
[]
[]
[]
[]
[]
[]
[]
[]
[]
[]
[]
[]
[]
[]
[]
[]
[]
[]
[]
[]
[]
[]
[]
[]
[]
[]
[]
[]
[]
[]
[]
[]
[]
[]
[]
[]
[]
[]
[]
[]
[]
[]
[]
[]
[]
[]
[]
[]
[]
[]
[]
[]
[]
[]
[]
[]
[]
[]
[]
[]
[]
[]
[]
[]
[]
[]
[]
[]
[]
[]
[]
[]
[]
[]
[]
[]
[]
[]
[]
[]
[]
[]
[]
[]
[]
[]
[]
[]
[]
[]
[]
[]
[]
[]
[]
[]
[]
[]
[]
[]
[]
[]
[]
[]
[]
[]
[]
[]
[]
[]
[]
[]
[]
[]
[]
[]
[]
[]
[]
[]
[]
[]
[]
[]
[]
[]
[]
[]
[]
[]
[]
[]
[]
[]
[]
[]
[]
[]
[]
[]
[]
[]
[]
[]
[]
[]
[]
[]
[]
[]
[]
[]
[]
[]
[]
[]
[]
[]
[]
[]
[]
[]
[]
[]
[]
[]
[]
[]
[]
[]
[]
[]
[]
[]
[]
[]
[]
[]
[]
[]
[]
[]
[]
[]
[]
[]
[]
[]
[]
[]
[]
[]
[]
[]
[]
[]
[]
[]
[]
[]
[]
[]
[]
[]
[]
[]
[]
[]
[]
[]
[]
[]
[]
[]
[]
[]
[]
[]
[]
[]
[]
[]
[]
[]
[]
[]
[]
[]
[]
[]
[]
[]
[]
[]
[]
[]
[]
[]
[]
[]
[]
[]
[]
[]
[]
[]
[]
[]
[]
[]
[]
[]
[]
[]
[]
[]
[]
[]
[]
[]
[]
[]
[]
[]
[]
[]
[]
[]
[]
[]
[]
[]
[]
[]
[]
[]
[]
[]
[]
[]
[]
[]
[]
[]
[]
[]
[]
[]
[]
[]
[]
[]
[]
[]
[]
[]
[]
[]
[]
[]
[]
[]
[]
[]
[]
[]
[]
[]
[]
[]
[]
[]
[]
[]
[]
[]
[]
[]
[]
[]
[]
[]
[]
[]
[]
[]
[]
[]
[]
[]
[]
[]
[]
[]
[]
[]
[]
[]
[]
[]
[]
[]
[]
[]
[]
[]
[]
[]
[]
[]
[]
[]
[]
[]
[]
[]
[]
[]
[]
[]
[]
[]
[]
[]
[]
[]
[]
[]
[]
[]
[]
[]
[]
[]
[]
[]
[]
[]
[]
[]
[]
[]
[]
[]
[]
[]
[]
[]
[]
[]
[]
[]
[]
[]
[]
[]
[]
[]
[]
[]
[]
[]
[]
[]
[]
[]
[]
[]
[]
[]
[]
[]
[]
[]
[]
[]
[]
[]
[]
[]
[]
[]
[]
[]
[]
[]
[]
[]
[]
[]
[]
[]
[]
[]
[]
[]
[]
[]
[]
[]
[]
[]
[]
[]
[]
[]
[]
[]
[]
[]
[]
[]
[]
[]
[]
[]
[]
[]
[]
[]
[]
[]
[]
[]
[]
[]
[]
[]
[]
[]
[]
[]
[]
[]
[]
[]
[]
[]
[]
[]
[]
[]
[]
[]
[]
[]
[]
[]
[]
[]
[]
[]
[]
[]
[]
[]
[]
[]
[]
[]
[]
[]
[]
[]
[]
[]
[]
[]
[]
[]
[]
[]
[]
[]
[]
[]
[]
[]
[]
[]
[]
[]
[]
[]
[]
[]
[]
[]
[]
[]
[]
[]
[]
[]
[]
[]
[]
[]
[]
[]
[]
[]
[]
[]
[]
[]
[]
[]
[]
[]
[]
[]
[]
[]
[]
[]
[]
[]
[]
[]
[]
[]
[]
[]
[]
[]
[]
[]
[]
[]
[]
[]
[]
[]
[]
[]
[]
[]
[]
[]
[]
[]
[]
[]
[]
[]
[]
[]
[]
[]
[]
[]
[]
[]
[]
[]
[]
[]
[]
[]
[]
[]
[]
[]
[]
[]
[]
[]
[]
[]
[]
[]
[]
[]
[]
[]
[]
[]
[]
[]
[]
[]
[]
[]
[]
[]
[]
[]
[]
[]
[]
[]
[]
[]
[]
[]
[]
[]
[]
[]
[]
[]
[]
[]
[]
[]
[]
[]
[]
[]
[]
[]
[]
[]
[]
[]
[]
[]
[]
[]
[]
[]
[]
[]
[]
[]
[]
[]
[]
[]
[]
[]
[]
[]
[]
[]
[]
[]
[]
[]
[]
[]
[]
[]
[]
[]
[]
[]
[]
[]
[]
[]
[]
[]
[]
[]
[]
[]
[]
[]
[]
[]
[]
[]
[]
[]
[]
[]
[]
[]
[]
[]
[]
[]
[]
[]
[]
[]
[]
[]
[]
[]
[]
[]
[]
[]
[]
[]
[]
[]
[]
[]
[]
[]
[]
[]
[]
[]
[]
[]
[]
[]
[]
[]
[]
[]
[]
[]
[]
[]
[]
[]
[]
[]
[]
[]
[]
[]
[]
[]
[]
[]
[]
[]
[]
[]
[]
[]
[]
[]
[]
[]
[]
[]
[]
[]
[]
[]
[]
[]
[]
[]
[]
[]
[]
[]
[]
[]
[]
[]
[]
[]
[]
[]
[]
[]
[]
[]
[]
[]
[]
[]
[]
[]
[]
[]
[]
[]
[]
[]
[]
[]
[]
[]
[]
[]
[]
[]
[]
[]
[]
[]
[]
[]
[]
[]
[]
[]
[]
[]
[]
[]
[]
[]
[]
[]
[]
[]
[]
[]
[]
[]
[]
[]
[]
[]
[]
[]
[]
[]
[]
[]
[]
[]
[]
[]
[]
[]
[]
[]
[]
[]
[]
[]
[]
[]
[]
[]
[]
[]
[]
[]
[]
[]
[]
[]
[]
[]
[]
[]
[]
[]
[]
[]
[]
[]
[]
[]
[]
[]
[]
[]
[]
[]
[]
[]
[]
[]
[]
[]
[]
[]
[]
[]
[]
[]
[]
[]
[]
[]
[]
[]
[]
[]
[]
[]
[]
[]
[]
[]
[]
[]
[]
[]
[]
[]
[]
[]
[]
[]
[]
[]
[]
[]
[]
[]
[]
[]
[]
[]
[]
[]
[]
[]
[]
[]
[]
[]
[]
[]
[]
[]
[]
[]
[]
[]
[]
[]
[]
[]
[]
[]
[]
[]
[]
[]
[]
[]
[]
[]
[]
[]
[]
[]
[]
[]
[]
[]
[]
[]
[]
[]
[]
[]
[]
[]
[]
[]
[]
[]
[]
[]
[]
[]
[]
[]
[]
[]
[]
[]
[]
[]
[]
[]
[]
[]
[]
[]
[]
[]
[]
[]
[]
[]
[]
[]
[]
[]
[]
[]
[]
[]
[]
[]
[]
[]
[]
[]
[]
[]
[]
[]
[]
[]
[]
[]
[]
[]
[]
[]
[]
[]
[]
[]
[]
[]
[]
[]
[]
[]
[]
[]
[]
[]
[]
[]
[]
[]
[]
[]
[]
[]
[]
[]
[]
[]
[]
[]
[]
[]
[]
[]
[]
[]
[]
[]
[]
[]
[]
[]
[]
[]
[]
[]
[]
[]
[]
[]
[]
[]
[]
[]
[]
[]
[]
[]
[]
[]
[]
[]
[]
[]
[]
[]
[]
[]
[]
[]
[]
[]
[]
[]
[]
[]
[]
[]
[]
[]
[]
[]
[]
[]
[]
[]
[]
[]
[]
[]
[]
[]
[]
[]
[]
[]
[]
[]
[]
[]
[]
[]
[]
[]
[]
[]
[]
[]
[]
[]
[]
[]
[]
[]
[]
[]
[]
[]
[]
[]
[]
[]
[]
[]
[]
[]
[]
[]
[]
[]
[]
[]
[]
[]
[]
[]
[]
[]
[]
[]
[]
[]
[]
[]
[]
[]
[]
[]
[]
[]
[]
[]
[]
[]
[]
[]
[]
[]
[]
[]
[]
[]
[]
[]
[]
[]
[]
[]
[]
[]
[]
[]
[]
[]
[]
[]
[]
[]
[]
[]
[]
[]
[]
[]
[]
[]
[]
[]
[]
[]
[]
[]
[]
[]
[]
[]
[]
[]
[]
[]
[]
[]
[]
[]
[]
[]
[]
[]
[]
[]
[]
[]
[]
[]
[]
[]
[]
[]
[]
[]
[]
[]
[]
[]
[]
[]
[]
[]
[]
[]
[]
[]
[]
[]
[]
[]
[]
[]
[]
[]
[]
[]
[]
[]
[]
[]
[]
[]
[]
[]
[]
[]
[]
[]
[]
[]
[]
[]
[]
[]
[]
[]
[]
[]
[]
[]
[]
[]
[]
[]
[]
[]
[]
[]
[]
[]
[]
[]
[]
[]
[]
[]
[]
[]
[]
[]
[]
[]
[]
[]
[]
[]
[]
["TOTAL DE RECURSOS APLICADOS:",null,null,null,null,null,null,{"$f":"SUM(H4:H2006)","v":51736.740000000005}]

{"sheet":"Lista Contemplados PNCV","index":5,"n_rows":2007,"n_cols":8,"rows_kept":2007,"cut":false,"hidden":false,"merged":[[0,8,2006,8],[2006,1,2006,5],[0,0,0,5]]}
["GOVERNO FEDERAL\nMinistério da Cultura\nPolítica Nacional Aldir Blanc (PNAB)\nPlanilha de Acompanhamento Ciclo 1."]
[{"$f":"CONCATENATE(\"LISTA DE CONTEMPLADOS NO CULTURA VIVA - \",UPPER(Informações!A6),\" - \",Informações!C6,\" \",IF(Informações!D6=\"\",\"\",CONCATENATE(\"- CNPJ \",Informações!D6)))","v":"LISTA DE CONTEMPLADOS NO CULTURA VIVA - NOVA BRASILÂNDIA - MT - CNPJ 15.023.963/0001-88"}]
["Número e Título do edital preenchido na aba\n Ações Cultura Viva","Nome do (a) Contemplado (a)","CPF (anonimizado)","CNPJ ","Nome do Projeto","Link da publicação da Lista de Contemplados","Valor pago ao contemplado","Observação"]
["EDITAL DE CHAMAMENTO PÚBLICO Nº. 002/2024 – QUEM SABE FAZ AO VIVO!!! ","não houveram","***0**"]
[]
[]
[]
[]
[]
[]
[]
[]
[]
[]
[]
[]
[]
[]
[]
[]
[]
[]
[]
[]
[]
[]
[]
[]
[]
[]
[]
[]
[]
[]
[]
[]
[]
[]
[]
[]
[]
[]
[]
[]
[]
[]
[]
[]
[]
[]
[]
[]
[]
[]
[]
[]
[]
[]
[]
[]
[]
[]
[]
[]
[]
[]
[]
[]
[]
[]
[]
[]
[]
[]
[]
[]
[]
[]
[]
[]
[]
[]
[]
[]
[]
[]
[]
[]
[]
[]
[]
[]
[]
[]
[]
[]
[]
[]
[]
[]
[]
[]
[]
[]
[]
[]
[]
[]
[]
[]
[]
[]
[]
[]
[]
[]
[]
[]
[]
[]
[]
[]
[]
[]
[]
[]
[]
[]
[]
[]
[]
[]
[]
[]
[]
[]
[]
[]
[]
[]
[]
[]
[]
[]
[]
[]
[]
[]
[]
[]
[]
[]
[]
[]
[]
[]
[]
[]
[]
[]
[]
[]
[]
[]
[]
[]
[]
[]
[]
[]
[]
[]
[]
[]
[]
[]
[]
[]
[]
[]
[]
[]
[]
[]
[]
[]
[]
[]
[]
[]
[]
[]
[]
[]
[]
[]
[]
[]
[]
[]
[]
[]
[]
[]
[]
[]
[]
[]
[]
[]
[]
[]
[]
[]
[]
[]
[]
[]
[]
[]
[]
[]
[]
[]
[]
[]
[]
[]
[]
[]
[]
[]
[]
[]
[]
[]
[]
[]
[]
[]
[]
[]
[]
[]
[]
[]
[]
[]
[]
[]
[]
[]
[]
[]
[]
[]
[]
[]
[]
[]
[]
[]
[]
[]
[]
[]
[]
[]
[]
[]
[]
[]
[]
[]
[]
[]
[]
[]
[]
[]
[]
[]
[]
[]
[]
[]
[]
[]
[]
[]
[]
[]
[]
[]
[]
[]
[]
[]
[]
[]
[]
[]
[]
[]
[]
[]
[]
[]
[]
[]
[]
[]
[]
[]
[]
[]
[]
[]
[]
[]
[]
[]
[]
[]
[]
[]
[]
[]
[]
[]
[]
[]
[]
[]
[]
[]
[]
[]
[]
[]
[]
[]
[]
[]
[]
[]
[]
[]
[]
[]
[]
[]
[]
[]
[]
[]
[]
[]
[]
[]
[]
[]
[]
[]
[]
[]
[]
[]
[]
[]
[]
[]
[]
[]
[]
[]
[]
[]
[]
[]
[]
[]
[]
[]
[]
[]
[]
[]
[]
[]
[]
[]
[]
[]
[]
[]
[]
[]
[]
[]
[]
[]
[]
[]
[]
[]
[]
[]
[]
[]
[]
[]
[]
[]
[]
[]
[]
[]
[]
[]
[]
[]
[]
[]
[]
[]
[]
[]
[]
[]
[]
[]
[]
[]
[]
[]
[]
[]
[]
[]
[]
[]
[]
[]
[]
[]
[]
[]
[]
[]
[]
[]
[]
[]
[]
[]
[]
[]
[]
[]
[]
[]
[]
[]
[]
[]
[]
[]
[]
[]
[]
[]
[]
[]
[]
[]
[]
[]
[]
[]
[]
[]
[]
[]
[]
[]
[]
[]
[]
[]
[]
[]
[]
[]
[]
[]
[]
[]
[]
[]
[]
[]
[]
[]
[]
[]
[]
[]
[]
[]
[]
[]
[]
[]
[]
[]
[]
[]
[]
[]
[]
[]
[]
[]
[]
[]
[]
[]
[]
[]
[]
[]
[]
[]
[]
[]
[]
[]
[]
[]
[]
[]
[]
[]
[]
[]
[]
[]
[]
[]
[]
[]
[]
[]
[]
[]
[]
[]
[]
[]
[]
[]
[]
[]
[]
[]
[]
[]
[]
[]
[]
[]
[]
[]
[]
[]
[]
[]
[]
[]
[]
[]
[]
[]
[]
[]
[]
[]
[]
[]
[]
[]
[]
[]
[]
[]
[]
[]
[]
[]
[]
[]
[]
[]
[]
[]
[]
[]
[]
[]
[]
[]
[]
[]
[]
[]
[]
[]
[]
[]
[]
[]
[]
[]
[]
[]
[]
[]
[]
[]
[]
[]
[]
[]
[]
[]
[]
[]
[]
[]
[]
[]
[]
[]
[]
[]
[]
[]
[]
[]
[]
[]
[]
[]
[]
[]
[]
[]
[]
[]
[]
[]
[]
[]
[]
[]
[]
[]
[]
[]
[]
[]
[]
[]
[]
[]
[]
[]
[]
[]
[]
[]
[]
[]
[]
[]
[]
[]
[]
[]
[]
[]
[]
[]
[]
[]
[]
[]
[]
[]
[]
[]
[]
[]
[]
[]
[]
[]
[]
[]
[]
[]
[]
[]
[]
[]
[]
[]
[]
[]
[]
[]
[]
[]
[]
[]
[]
[]
[]
[]
[]
[]
[]
[]
[]
[]
[]
[]
[]
[]
[]
[]
[]
[]
[]
[]
[]
[]
[]
[]
[]
[]
[]
[]
[]
[]
[]
[]
[]
[]
[]
[]
[]
[]
[]
[]
[]
[]
[]
[]
[]
[]
[]
[]
[]
[]
[]
[]
[]
[]
[]
[]
[]
[]
[]
[]
[]
[]
[]
[]
[]
[]
[]
[]
[]
[]
[]
[]
[]
[]
[]
[]
[]
[]
[]
[]
[]
[]
[]
[]
[]
[]
[]
[]
[]
[]
[]
[]
[]
[]
[]
[]
[]
[]
[]
[]
[]
[]
[]
[]
[]
[]
[]
[]
[]
[]
[]
[]
[]
[]
[]
[]
[]
[]
[]
[]
[]
[]
[]
[]
[]
[]
[]
[]
[]
[]
[]
[]
[]
[]
[]
[]
[]
[]
[]
[]
[]
[]
[]
[]
[]
[]
[]
[]
[]
[]
[]
[]
[]
[]
[]
[]
[]
[]
[]
[]
[]
[]
[]
[]
[]
[]
[]
[]
[]
[]
[]
[]
[]
[]
[]
[]
[]
[]
[]
[]
[]
[]
[]
[]
[]
[]
[]
[]
[]
[]
[]
[]
[]
[]
[]
[]
[]
[]
[]
[]
[]
[]
[]
[]
[]
[]
[]
[]
[]
[]
[]
[]
[]
[]
[]
[]
[]
[]
[]
[]
[]
[]
[]
[]
[]
[]
[]
[]
[]
[]
[]
[]
[]
[]
[]
[]
[]
[]
[]
[]
[]
[]
[]
[]
[]
[]
[]
[]
[]
[]
[]
[]
[]
[]
[]
[]
[]
[]
[]
[]
[]
[]
[]
[]
[]
[]
[]
[]
[]
[]
[]
[]
[]
[]
[]
[]
[]
[]
[]
[]
[]
[]
[]
[]
[]
[]
[]
[]
[]
[]
[]
[]
[]
[]
[]
[]
[]
[]
[]
[]
[]
[]
[]
[]
[]
[]
[]
[]
[]
[]
[]
[]
[]
[]
[]
[]
[]
[]
[]
[]
[]
[]
[]
[]
[]
[]
[]
[]
[]
[]
[]
[]
[]
[]
[]
[]
[]
[]
[]
[]
[]
[]
[]
[]
[]
[]
[]
[]
[]
[]
[]
[]
[]
[]
[]
[]
[]
[]
[]
[]
[]
[]
[]
[]
[]
[]
[]
[]
[]
[]
[]
[]
[]
[]
[]
[]
[]
[]
[]
[]
[]
[]
[]
[]
[]
[]
[]
[]
[]
[]
[]
[]
[]
[]
[]
[]
[]
[]
[]
[]
[]
[]
[]
[]
[]
[]
[]
[]
[]
[]
[]
[]
[]
[]
[]
[]
[]
[]
[]
[]
[]
[]
[]
[]
[]
[]
[]
[]
[]
[]
[]
[]
[]
[]
[]
[]
[]
[]
[]
[]
[]
[]
[]
[]
[]
[]
[]
[]
[]
[]
[]
[]
[]
[]
[]
[]
[]
[]
[]
[]
[]
[]
[]
[]
[]
[]
[]
[]
[]
[]
[]
[]
[]
[]
[]
[]
[]
[]
[]
[]
[]
[]
[]
[]
[]
[]
[]
[]
[]
[]
[]
[]
[]
[]
[]
[]
[]
[]
[]
[]
[]
[]
[]
[]
[]
[]
[]
[]
[]
[]
[]
[]
[]
[]
[]
[]
[]
[]
[]
[]
[]
[]
[]
[]
[]
[]
[]
[]
[]
[]
[]
[]
[]
[]
[]
[]
[]
[]
[]
[]
[]
[]
[]
[]
[]
[]
[]
[]
[]
[]
[]
[]
[]
[]
[]
[]
[]
[]
[]
[]
[]
[]
[]
[]
[]
[]
[]
[]
[]
[]
[]
[]
[]
[]
[]
[]
[]
[]
[]
[]
[]
[]
[]
[]
[]
[]
[]
[]
[]
[]
[]
[]
[]
[]
[]
[]
[]
[]
[]
[]
[]
[]
[]
[]
[]
[]
[]
[]
[]
[]
[]
[]
[]
[]
[]
[]
[]
[]
[]
[]
[]
[]
[]
[]
[]
[]
[]
[]
[]
[]
[]
[]
[]
[]
[]
[]
[]
[]
[]
[]
[]
[]
[]
[]
[]
[]
[]
[]
[]
[]
[]
[]
[]
[]
[]
[]
[]
[]
[]
[]
[]
[]
[]
[]
[]
[]
[]
[]
[]
[]
[]
[]
[]
[]
[]
[]
[]
[]
[]
[]
[]
[]
[]
[]
[]
[]
[]
[]
[]
[]
[]
[]
[]
[]
[]
[]
[]
[]
[]
[]
[]
[]
[]
[]
[]
[]
[]
[]
[]
[]
[]
[]
[]
[]
[]
[]
[]
[]
[]
[]
[]
[]
[]
[]
[]
[]
[]
[]
[]
[]
[]
[]
[]
[]
[]
[]
[]
[]
[]
[]
[]
[]
[]
[]
[]
[]
[]
[]
[]
[]
[]
[]
[]
[]
[]
[]
[]
[]
[]
[]
[]
[]
[]
[]
[]
[]
[]
[]
[]
[]
[]
[]
[]
[]
[]
[]
[]
[]
[]
[]
[]
[]
[]
[]
[]
[]
[]
[]
[]
[]
[]
[]
[]
[]
[]
[]
[]
[]
[]
[]
[]
[]
[]
[]
[]
[]
[]
[]
[]
[]
[]
[]
[]
[]
[]
[]
[]
[]
[]
[]
[]
[]
[]
[]
[]
[]
[]
[]
[]
[]
[]
[]
[]
[]
[]
[]
[]
[]
[]
[]
[]
[]
[]
[]
[]
[]
[]
[]
[]
[]
[]
[]
[]
[]
[]
[]
[]
[]
[]
[]
[]
[]
[]
[]
[]
[]
[]
[]
[]
[]
[]
[]
[]
[]
[]
[]
[]
[]
[]
[]
[]
[]
[]
[]
[]
[]
[]
[]
[]
[]
[]
[]
[]
[]
[]
[]
[]
[]
[]
[]
[]
[]
[]
[]
[]
[]
[]
[]
[]
[]
[]
[]
[]
[]
[]
[]
[]
[]
[]
[]
[]
[]
[]
[]
[]
[]
[]
[]
[]
[]
[]
[]
[]
[]
[]
[]
[]
[]
[]
[]
[]
[]
[]
[]
[]
[]
[]
[]
[]
[]
[]
[]
[]
[]
[]
[]
[]
[]
[]
[]
[]
[]
[]
[]
[]
[]
[]
[]
[]
[]
[]
[]
[]
[]
[]
[]
[]
[]
[]
[]
[]
[]
[]
[]
[]
[]
[]
[]
[]
[]
[]
[]
[]
[]
[]
[]
[]
[]
[]
[]
[]
[]
[]
[]
[]
[]
[]
[]
[]
[]
[]
[]
[]
[]
[]
[]
[]
[]
[]
[]
[]
[]
[]
[]
[]
[]
[]
[]
[]
[]
[]
[]
[]
[]
[]
[]
[]
[]
[]
[]
[]
[]
[]
[]
[]
[]
[]
[]
[]
[]
[]
[]
[]
[]
[]
[]
[]
[]
[]
[]
[]
[]
[]
[]
[]
[]
[]
[]
[]
[]
[]
[]
[]
[]
[]
[]
[]
[]
[]
[]
[]
[]
[]
[]
[]
[]
[]
[]
[]
[]
[]
[]
[]
[]
[]
[]
[]
[]
[]
[]
[]
[]
[]
[]
[]
[]
[]
[]
[]
[]
[]
[]
[]
[]
[]
[]
[]
[]
[]
[]
[]
[]
[]
[]
[]
[]
[]
[]
[]
[]
[]
[]
[]
[]
[]
[]
[]
[]
[]
[]
[]
[]
[]
[]
[]
[]
[]
[]
[]
[]
[]
[]
[]
[]
[]
[]
[]
[]
[]
[]
[]
[]
[]
[]
[]
[]
[]
[]
[]
[]
[]
[]
[]
[]
[]
[]
[]
[]
[]
[]
[]
[]
[]
[]
[]
[]
[]
[]
[]
[]
[]
[]
[]
[]
[]
[]
[]
[]
[]
[]
[]
[]
[]
[]
[]
[]
[]
[]
[]
[]
[]
[]
[]
[]
[]
[]
[]
[]
[]
[]
[]
[]
[]
[]
[]
[]
[]
[]
[]
[]
[]
[]
[]
[]
[]
[]
[]
[]
[]
[]
[]
[]
[]
[]
[]
[]
[]
[]
[]
[]
[]
[]
[]
[]
[]
[]
[]
[]
[]
[]
[]
[]
[]
[]
[]
[]
[]
[]
[]
[]
[]
[]
[]
[]
[]
[]
[]
[]
[]
[]
[null,"TOTAL DE RECURSOS APLICADOS:",null,null,null,null,{"$f":"SUM(G4:G2006)","v":0}]

{"sheet":"Dados","index":6,"n_rows":308,"n_cols":8,"rows_kept":308,"cut":false,"hidden":true,"merged":[]}
["Forma de execução dos recursos","Forma de Execução Operacionalização","A atividade destina recursos para áreas periféricas e/ou de povos tradicionais?","UF","Editais Cultura Viva"]
["Chamamento público - Fomento à execução de ações culturais - Projeto (Decreto 11.453/2023 e Lei 14.903/2024) ","Termo de Colaboração - Parceria MROSC (Lei 13.019/2014)","Sim","AC","Fomento a projetos continuados de Pontos de Cultura"]
["Chamamento público - Apoio a espaços culturais - Projeto (Decreto 11.453/2023 e Lei 14.903/2024) ","Licitação (Lei 14.133/2021)","Não","AL","Fomento a projetos continuados de Pontões de Cultura"]
["Chamamento público - Bolsas Culturais (Decreto 11.453/2023 e Lei 14.903/2024) ","Inexigibilidade (Lei 14.133/2021)",null,"AP","Premiação de Pontos e Pontões de Cultura"]
["Chamamento público - Premiação Cultural (Decreto 11.453/2023 e Lei 14.903/2024) ","Credenciamento (Lei 14.133/2021)",null,"AM"]
["Termo de Colaboração - Parceria MROSC (Lei 13.019/2014)","Dispensa (Lei 14.133/2021)",null,"BA"]
["Termo de Fomento - Parceria MROSC (Lei 13.019/2014) ","Adesão a ata de registro de preço de outro órgão (Lei 14.133/2021)",null,"CE"]
["Licitação (Lei 14.133/2021)","Convênio/descentralização para outro ente público (especifique no campo observação)",null,"DF"]
["Inexigibilidade (Lei 14.133/2021)","Outras (especifique no campo observação)",null,"ES"]
["Credenciamento (Lei 14.133/2021)",null,null,"GO"]
["Dispensa (Lei 14.133/2021)",null,null,"MA"]
["Adesão à ata de registro de preço de outro órgão (Lei 14.133/2021)",null,null,"MT"]
["Convênio/descentralização para outro ente público (especifique no campo observação)",null,null,"MS"]
["Outras (especifique no campo observação)",null,null,"MG"]
[null,null,null,"PA"]
[null,null,null,"PB"]
[null,null,null,"PR"]
["Atividades preenchidas em Ações Gerais","Atividades preenchidas em Cultura Viva","Lista Fixa","PE",null,{"$f":"IF((COUNTA('Ações gerais'!A4:A203)+COUNTA(Operacionalização!A4:A93))=0,\n\"Insira informações na aba Ações gerais/Operacionalização na coluna Nome da Atividade\",\n\"\")","v":""}]
[{"$f":"IF($F$18<>\"\",\n$F$18,\nIFERROR(\n   INDEX($E$19:$E$308,\n      _xlfn.AGGREGATE(15,6,\n         (ROW($E$19:$E$308)-ROW($E$19)+1)/($E$19:$E$308<>\"\"),\n         ROW()-ROW($A$19)+1\n      )\n   ),\n\"\"))","v":"EDITAL DE FOMENTO CULTURAL 002/2024"},{"$f":"IF($F$19<>\"\",\n$F$19,\nIFERROR(\n   INDEX($H$19:$H$80,\n      _xlfn.AGGREGATE(15,6,\n         (ROW($H$19:$H$80)-ROW($H$19)+1)/($H$19:$H$80<>\"\"),\n         ROW()-ROW($B$19)+1\n      )\n   ),\n\"\"))","v":"EDITAL DE CHAMAMENTO PÚBLICO Nº. 002/2024 – QUEM SABE FAZ AO VIVO!!! "},{"$f":"IF($F$18<>\"\",\n\"\",\nIF(ROW()-ROW($C$19)+1<=ROWS('Ações gerais'!$A$4:$A$203),\n   INDEX('Ações gerais'!$A$4:$A$203, ROW()-ROW($C$19)+1),\n   INDEX(Operacionalização!$A$4:$A$93, ROW()-ROW($C$19)+1 - ROWS('Ações gerais'!$A$4:$A$203))\n))","v":"EDITAL DE FOMENTO CULTURAL 002/2024"},"PI",{"$f":"IF($F$18<>\"\",\n\"\",\nIF(OR($C19=\"\",$C19=0),\n   \"\",\n   IF(COUNTIF($C$19:C19,C19)=1,C19,\"\")\n))","v":"EDITAL DE FOMENTO CULTURAL 002/2024"},{"$f":"IF(COUNTA('Ações Cultura Viva'!B4:B59)=0,\n\"Insira informações na aba Ações Cultura Viva na coluna Número e título do edital\",\n\"\")","v":""},{"$f":"IF($F$19<>\"\",\n\"\",\nIF('Ações Cultura Viva'!B4=\"\",\n   \"\",\n   'Ações Cultura Viva'!B4\n))","v":"EDITAL DE CHAMAMENTO PÚBLICO Nº. 002/2024 – QUEM SABE FAZ AO VIVO!!! "},{"$f":"IF($F$19<>\"\",\n\"\",\nIF(G19=\"\",\n   \"\",\n   IF(COUNTIF($G$19:G19,G19)=1,G19,\"\")\n))","v":"EDITAL DE CHAMAMENTO PÚBLICO Nº. 002/2024 – QUEM SABE FAZ AO VIVO!!! "}]
[{"$f":"IF($F$18<>\"\",\n$F$18,\nIFERROR(\n   INDEX($E$19:$E$308,\n      _xlfn.AGGREGATE(15,6,\n         (ROW($E$19:$E$308)-ROW($E$19)+1)/($E$19:$E$308<>\"\"),\n         ROW()-ROW($A$19)+1\n      )\n   ),\n\"\"))","v":"Chamamento público - Fomento à execução de ações culturais - Projeto (Decreto 11.453/2023 e Lei 14.903/2024) "},{"$f":"IF($F$19<>\"\",\n$F$19,\nIFERROR(\n   INDEX($H$19:$H$80,\n      _xlfn.AGGREGATE(15,6,\n         (ROW($H$19:$H$80)-ROW($H$19)+1)/($H$19:$H$80<>\"\"),\n         ROW()-ROW($B$19)+1\n      )\n   ),\n\"\"))","v":""},{"$f":"IF($F$18<>\"\",\n\"\",\nIF(ROW()-ROW($C$19)+1<=ROWS('Ações gerais'!$A$4:$A$203),\n   INDEX('Ações gerais'!$A$4:$A$203, ROW()-ROW($C$19)+1),\n   INDEX(Operacionalização!$A$4:$A$93, ROW()-ROW($C$19)+1 - ROWS('Ações gerais'!$A$4:$A$203))\n))","v":0},"RJ",{"$f":"IF($F$18<>\"\",\n\"\",\nIF(OR($C20=\"\",$C20=0),\n   \"\",\n   IF(COUNTIF($C$19:C20,C20)=1,C20,\"\")\n))","v":""},null,{"$f":"IF($F$19<>\"\",\n\"\",\nIF('Ações Cultura Viva'!B5=\"\",\n   \"\",\n   'Ações Cultura Viva'!B5\n))","v":""},{"$f":"IF($F$19<>\"\",\n\"\",\nIF(G20=\"\",\n   \"\",\n   IF(COUNTIF($G$19:G20,G20)=1,G20,\"\")\n))","v":""}]
[{"$f":"IF($F$18<>\"\",\n$F$18,\nIFERROR(\n   INDEX($E$19:$E$308,\n      _xlfn.AGGREGATE(15,6,\n         (ROW($E$19:$E$308)-ROW($E$19)+1)/($E$19:$E$308<>\"\"),\n         ROW()-ROW($A$19)+1\n      )\n   ),\n\"\"))","v":""},{"$f":"IF($F$19<>\"\",\n$F$19,\nIFERROR(\n   INDEX($H$19:$H$80,\n      _xlfn.AGGREGATE(15,6,\n         (ROW($H$19:$H$80)-ROW($H$19)+1)/($H$19:$H$80<>\"\"),\n         ROW()-ROW($B$19)+1\n      )\n   ),\n\"\"))","v":""},{"$f":"IF($F$18<>\"\",\n\"\",\nIF(ROW()-ROW($C$19)+1<=ROWS('Ações gerais'!$A$4:$A$203),\n   INDEX('Ações gerais'!$A$4:$A$203, ROW()-ROW($C$19)+1),\n   INDEX(Operacionalização!$A$4:$A$93, ROW()-ROW($C$19)+1 - ROWS('Ações gerais'!$A$4:$A$203))\n))","v":0},"RN",{"$f":"IF($F$18<>\"\",\n\"\",\nIF(OR($C21=\"\",$C21=0),\n   \"\",\n   IF(COUNTIF($C$19:C21,C21)=1,C21,\"\")\n))","v":""},null,{"$f":"IF($F$19<>\"\",\n\"\",\nIF('Ações Cultura Viva'!B6=\"\",\n   \"\",\n   'Ações Cultura Viva'!B6\n))","v":""},{"$f":"IF($F$19<>\"\",\n\"\",\nIF(G21=\"\",\n   \"\",\n   IF(COUNTIF($G$19:G21,G21)=1,G21,\"\")\n))","v":""}]
[{"$f":"IF($F$18<>\"\",\n$F$18,\nIFERROR(\n   INDEX($E$19:$E$308,\n      _xlfn.AGGREGATE(15,6,\n         (ROW($E$19:$E$308)-ROW($E$19)+1)/($E$19:$E$308<>\"\"),\n         ROW()-ROW($A$19)+1\n      )\n   ),\n\"\"))","v":""},{"$f":"IF($F$19<>\"\",\n$F$19,\nIFERROR(\n   INDEX($H$19:$H$80,\n      _xlfn.AGGREGATE(15,6,\n         (ROW($H$19:$H$80)-ROW($H$19)+1)/($H$19:$H$80<>\"\"),\n         ROW()-ROW($B$19)+1\n      )\n   ),\n\"\"))","v":""},{"$f":"IF($F$18<>\"\",\n\"\",\nIF(ROW()-ROW($C$19)+1<=ROWS('Ações gerais'!$A$4:$A$203),\n   INDEX('Ações gerais'!$A$4:$A$203, ROW()-ROW($C$19)+1),\n   INDEX(Operacionalização!$A$4:$A$93, ROW()-ROW($C$19)+1 - ROWS('Ações gerais'!$A$4:$A$203))\n))","v":0},"RS",{"$f":"IF($F$18<>\"\",\n\"\",\nIF(OR($C22=\"\",$C22=0),\n   \"\",\n   IF(COUNTIF($C$19:C22,C22)=1,C22,\"\")\n))","v":""},null,{"$f":"IF($F$19<>\"\",\n\"\",\nIF('Ações Cultura Viva'!B7=\"\",\n   \"\",\n   'Ações Cultura Viva'!B7\n))","v":""},{"$f":"IF($F$19<>\"\",\n\"\",\nIF(G22=\"\",\n   \"\",\n   IF(COUNTIF($G$19:G22,G22)=1,G22,\"\")\n))","v":""}]
[{"$f":"IF($F$18<>\"\",\n$F$18,\nIFERROR(\n   INDEX($E$19:$E$308,\n      _xlfn.AGGREGATE(15,6,\n         (ROW($E$19:$E$308)-ROW($E$19)+1)/($E$19:$E$308<>\"\"),\n         ROW()-ROW($A$19)+1\n      )\n   ),\n\"\"))","v":""},{"$f":"IF($F$19<>\"\",\n$F$19,\nIFERROR(\n   INDEX($H$19:$H$80,\n      _xlfn.AGGREGATE(15,6,\n         (ROW($H$19:$H$80)-ROW($H$19)+1)/($H$19:$H$80<>\"\"),\n         ROW()-ROW($B$19)+1\n      )\n   ),\n\"\"))","v":""},{"$f":"IF($F$18<>\"\",\n\"\",\nIF(ROW()-ROW($C$19)+1<=ROWS('Ações gerais'!$A$4:$A$203),\n   INDEX('Ações gerais'!$A$4:$A$203, ROW()-ROW($C$19)+1),\n   INDEX(Operacionalização!$A$4:$A$93, ROW()-ROW($C$19)+1 - ROWS('Ações gerais'!$A$4:$A$203))\n))","v":0},"RO",{"$f":"IF($F$18<>\"\",\n\"\",\nIF(OR($C23=\"\",$C23=0),\n   \"\",\n   IF(COUNTIF($C$19:C23,C23)=1,C23,\"\")\n))","v":""},null,{"$f":"IF($F$19<>\"\",\n\"\",\nIF('Ações Cultura Viva'!B8=\"\",\n   \"\",\n   'Ações Cultura Viva'!B8\n))","v":""},{"$f":"IF($F$19<>\"\",\n\"\",\nIF(G23=\"\",\n   \"\",\n   IF(COUNTIF($G$19:G23,G23)=1,G23,\"\")\n))","v":""}]
[{"$f":"IF($F$18<>\"\",\n$F$18,\nIFERROR(\n   INDEX($E$19:$E$308,\n      _xlfn.AGGREGATE(15,6,\n         (ROW($E$19:$E$308)-ROW($E$19)+1)/($E$19:$E$308<>\"\"),\n         ROW()-ROW($A$19)+1\n      )\n   ),\n\"\"))","v":""},{"$f":"IF($F$19<>\"\",\n$F$19,\nIFERROR(\n   INDEX($H$19:$H$80,\n      _xlfn.AGGREGATE(15,6,\n         (ROW($H$19:$H$80)-ROW($H$19)+1)/($H$19:$H$80<>\"\"),\n         ROW()-ROW($B$19)+1\n      )\n   ),\n\"\"))","v":""},{"$f":"IF($F$18<>\"\",\n\"\",\nIF(ROW()-ROW($C$19)+1<=ROWS('Ações gerais'!$A$4:$A$203),\n   INDEX('Ações gerais'!$A$4:$A$203, ROW()-ROW($C$19)+1),\n   INDEX(Operacionalização!$A$4:$A$93, ROW()-ROW($C$19)+1 - ROWS('Ações gerais'!$A$4:$A$203))\n))","v":0},"RR",{"$f":"IF($F$18<>\"\",\n\"\",\nIF(OR($C24=\"\",$C24=0),\n   \"\",\n   IF(COUNTIF($C$19:C24,C24)=1,C24,\"\")\n))","v":""},null,{"$f":"IF($F$19<>\"\",\n\"\",\nIF('Ações Cultura Viva'!B9=\"\",\n   \"\",\n   'Ações Cultura Viva'!B9\n))","v":""},{"$f":"IF($F$19<>\"\",\n\"\",\nIF(G24=\"\",\n   \"\",\n   IF(COUNTIF($G$19:G24,G24)=1,G24,\"\")\n))","v":""}]
[{"$f":"IF($F$18<>\"\",\n$F$18,\nIFERROR(\n   INDEX($E$19:$E$308,\n      _xlfn.AGGREGATE(15,6,\n         (ROW($E$19:$E$308)-ROW($E$19)+1)/($E$19:$E$308<>\"\"),\n         ROW()-ROW($A$19)+1\n      )\n   ),\n\"\"))","v":""},{"$f":"IF($F$19<>\"\",\n$F$19,\nIFERROR(\n   INDEX($H$19:$H$80,\n      _xlfn.AGGREGATE(15,6,\n         (ROW($H$19:$H$80)-ROW($H$19)+1)/($H$19:$H$80<>\"\"),\n         ROW()-ROW($B$19)+1\n      )\n   ),\n\"\"))","v":""},{"$f":"IF($F$18<>\"\",\n\"\",\nIF(ROW()-ROW($C$19)+1<=ROWS('Ações gerais'!$A$4:$A$203),\n   INDEX('Ações gerais'!$A$4:$A$203, ROW()-ROW($C$19)+1),\n   INDEX(Operacionalização!$A$4:$A$93, ROW()-ROW($C$19)+1 - ROWS('Ações gerais'!$A$4:$A$203))\n))","v":0},"SC",{"$f":"IF($F$18<>\"\",\n\"\",\nIF(OR($C25=\"\",$C25=0),\n   \"\",\n   IF(COUNTIF($C$19:C25,C25)=1,C25,\"\")\n))","v":""},null,{"$f":"IF($F$19<>\"\",\n\"\",\nIF('Ações Cultura Viva'!B10=\"\",\n   \"\",\n   'Ações Cultura Viva'!B10\n))","v":""},{"$f":"IF($F$19<>\"\",\n\"\",\nIF(G25=\"\",\n   \"\",\n   IF(COUNTIF($G$19:G25,G25)=1,G25,\"\")\n))","v":""}]
[{"$f":"IF($F$18<>\"\",\n$F$18,\nIFERROR(\n   INDEX($E$19:$E$308,\n      _xlfn.AGGREGATE(15,6,\n         (ROW($E$19:$E$308)-ROW($E$19)+1)/($E$19:$E$308<>\"\"),\n         ROW()-ROW($A$19)+1\n      )\n   ),\n\"\"))","v":""},{"$f":"IF($F$19<>\"\",\n$F$19,\nIFERROR(\n   INDEX($H$19:$H$80,\n      _xlfn.AGGREGATE(15,6,\n         (ROW($H$19:$H$80)-ROW($H$19)+1)/($H$19:$H$80<>\"\"),\n         ROW()-ROW($B$19)+1\n      )\n   ),\n\"\"))","v":""},{"$f":"IF($F$18<>\"\",\n\"\",\nIF(ROW()-ROW($C$19)+1<=ROWS('Ações gerais'!$A$4:$A$203),\n   INDEX('Ações gerais'!$A$4:$A$203, ROW()-ROW($C$19)+1),\n   INDEX(Operacionalização!$A$4:$A$93, ROW()-ROW($C$19)+1 - ROWS('Ações gerais'!$A$4:$A$203))\n))","v":0},"SP",{"$f":"IF($F$18<>\"\",\n\"\",\nIF(OR($C26=\"\",$C26=0),\n   \"\",\n   IF(COUNTIF($C$19:C26,C26)=1,C26,\"\")\n))","v":""},null,{"$f":"IF($F$19<>\"\",\n\"\",\nIF('Ações Cultura Viva'!B11=\"\",\n   \"\",\n   'Ações Cultura Viva'!B11\n))","v":""},{"$f":"IF($F$19<>\"\",\n\"\",\nIF(G26=\"\",\n   \"\",\n   IF(COUNTIF($G$19:G26,G26)=1,G26,\"\")\n))","v":""}]
[{"$f":"IF($F$18<>\"\",\n$F$18,\nIFERROR(\n   INDEX($E$19:$E$308,\n      _xlfn.AGGREGATE(15,6,\n         (ROW($E$19:$E$308)-ROW($E$19)+1)/($E$19:$E$308<>\"\"),\n         ROW()-ROW($A$19)+1\n      )\n   ),\n\"\"))","v":""},{"$f":"IF($F$19<>\"\",\n$F$19,\nIFERROR(\n   INDEX($H$19:$H$80,\n      _xlfn.AGGREGATE(15,6,\n         (ROW($H$19:$H$80)-ROW($H$19)+1)/($H$19:$H$80<>\"\"),\n         ROW()-ROW($B$19)+1\n      )\n   ),\n\"\"))","v":""},{"$f":"IF($F$18<>\"\",\n\"\",\nIF(ROW()-ROW($C$19)+1<=ROWS('Ações gerais'!$A$4:$A$203),\n   INDEX('Ações gerais'!$A$4:$A$203, ROW()-ROW($C$19)+1),\n   INDEX(Operacionalização!$A$4:$A$93, ROW()-ROW($C$19)+1 - ROWS('Ações gerais'!$A$4:$A$203))\n))","v":0},"SE",{"$f":"IF($F$18<>\"\",\n\"\",\nIF(OR($C27=\"\",$C27=0),\n   \"\",\n   IF(COUNTIF($C$19:C27,C27)=1,C27,\"\")\n))","v":""},null,{"$f":"IF($F$19<>\"\",\n\"\",\nIF('Ações Cultura Viva'!B12=\"\",\n   \"\",\n   'Ações Cultura Viva'!B12\n))","v":""},{"$f":"IF($F$19<>\"\",\n\"\",\nIF(G27=\"\",\n   \"\",\n   IF(COUNTIF($G$19:G27,G27)=1,G27,\"\")\n))","v":""}]
[{"$f":"IF($F$18<>\"\",\n$F$18,\nIFERROR(\n   INDEX($E$19:$E$308,\n      _xlfn.AGGREGATE(15,6,\n         (ROW($E$19:$E$308)-ROW($E$19)+1)/($E$19:$E$308<>\"\"),\n         ROW()-ROW($A$19)+1\n      )\n   ),\n\"\"))","v":""},{"$f":"IF($F$19<>\"\",\n$F$19,\nIFERROR(\n   INDEX($H$19:$H$80,\n      _xlfn.AGGREGATE(15,6,\n         (ROW($H$19:$H$80)-ROW($H$19)+1)/($H$19:$H$80<>\"\"),\n         ROW()-ROW($B$19)+1\n      )\n   ),\n\"\"))","v":""},{"$f":"IF($F$18<>\"\",\n\"\",\nIF(ROW()-ROW($C$19)+1<=ROWS('Ações gerais'!$A$4:$A$203),\n   INDEX('Ações gerais'!$A$4:$A$203, ROW()-ROW($C$19)+1),\n   INDEX(Operacionalização!$A$4:$A$93, ROW()-ROW($C$19)+1 - ROWS('Ações gerais'!$A$4:$A$203))\n))","v":0},"TO",{"$f":"IF($F$18<>\"\",\n\"\",\nIF(OR($C28=\"\",$C28=0),\n   \"\",\n   IF(COUNTIF($C$19:C28,C28)=1,C28,\"\")\n))","v":""},null,{"$f":"IF($F$19<>\"\",\n\"\",\nIF('Ações Cultura Viva'!B13=\"\",\n   \"\",\n   'Ações Cultura Viva'!B13\n))","v":""},{"$f":"IF($F$19<>\"\",\n\"\",\nIF(G28=\"\",\n   \"\",\n   IF(COUNTIF($G$19:G28,G28)=1,G28,\"\")\n))","v":""}]
[{"$f":"IF($F$18<>\"\",\n$F$18,\nIFERROR(\n   INDEX($E$19:$E$308,\n      _xlfn.AGGREGATE(15,6,\n         (ROW($E$19:$E$308)-ROW($E$19)+1)/($E$19:$E$308<>\"\"),\n         ROW()-ROW($A$19)+1\n      )\n   ),\n\"\"))","v":""},{"$f":"IF($F$19<>\"\",\n$F$19,\nIFERROR(\n   INDEX($H$19:$H$80,\n      _xlfn.AGGREGATE(15,6,\n         (ROW($H$19:$H$80)-ROW($H$19)+1)/($H$19:$H$80<>\"\"),\n         ROW()-ROW($B$19)+1\n      )\n   ),\n\"\"))","v":""},{"$f":"IF($F$18<>\"\",\n\"\",\nIF(ROW()-ROW($C$19)+1<=ROWS('Ações gerais'!$A$4:$A$203),\n   INDEX('Ações gerais'!$A$4:$A$203, ROW()-ROW($C$19)+1),\n   INDEX(Operacionalização!$A$4:$A$93, ROW()-ROW($C$19)+1 - ROWS('Ações gerais'!$A$4:$A$203))\n))","v":0},null,{"$f":"IF($F$18<>\"\",\n\"\",\nIF(OR($C29=\"\",$C29=0),\n   \"\",\n   IF(COUNTIF($C$19:C29,C29)=1,C29,\"\")\n))","v":""},null,{"$f":"IF($F$19<>\"\",\n\"\",\nIF('Ações Cultura Viva'!B14=\"\",\n   \"\",\n   'Ações Cultura Viva'!B14\n))","v":""},{"$f":"IF($F$19<>\"\",\n\"\",\nIF(G29=\"\",\n   \"\",\n   IF(COUNTIF($G$19:G29,G29)=1,G29,\"\")\n))","v":""}]
[{"$f":"IF($F$18<>\"\",\n$F$18,\nIFERROR(\n   INDEX($E$19:$E$308,\n      _xlfn.AGGREGATE(15,6,\n         (ROW($E$19:$E$308)-ROW($E$19)+1)/($E$19:$E$308<>\"\"),\n         ROW()-ROW($A$19)+1\n      )\n   ),\n\"\"))","v":""},{"$f":"IF($F$19<>\"\",\n$F$19,\nIFERROR(\n   INDEX($H$19:$H$80,\n      _xlfn.AGGREGATE(15,6,\n         (ROW($H$19:$H$80)-ROW($H$19)+1)/($H$19:$H$80<>\"\"),\n         ROW()-ROW($B$19)+1\n      )\n   ),\n\"\"))","v":""},{"$f":"IF($F$18<>\"\",\n\"\",\nIF(ROW()-ROW($C$19)+1<=ROWS('Ações gerais'!$A$4:$A$203),\n   INDEX('Ações gerais'!$A$4:$A$203, ROW()-ROW($C$19)+1),\n   INDEX(Operacionalização!$A$4:$A$93, ROW()-ROW($C$19)+1 - ROWS('Ações gerais'!$A$4:$A$203))\n))","v":0},null,{"$f":"IF($F$18<>\"\",\n\"\",\nIF(OR($C30=\"\",$C30=0),\n   \"\",\n   IF(COUNTIF($C$19:C30,C30)=1,C30,\"\")\n))","v":""},null,{"$f":"IF($F$19<>\"\",\n\"\",\nIF('Ações Cultura Viva'!B15=\"\",\n   \"\",\n   'Ações Cultura Viva'!B15\n))","v":""},{"$f":"IF($F$19<>\"\",\n\"\",\nIF(G30=\"\",\n   \"\",\n   IF(COUNTIF($G$19:G30,G30)=1,G30,\"\")\n))","v":""}]
[{"$f":"IF($F$18<>\"\",\n$F$18,\nIFERROR(\n   INDEX($E$19:$E$308,\n      _xlfn.AGGREGATE(15,6,\n         (ROW($E$19:$E$308)-ROW($E$19)+1)/($E$19:$E$308<>\"\"),\n         ROW()-ROW($A$19)+1\n      )\n   ),\n\"\"))","v":""},{"$f":"IF($F$19<>\"\",\n$F$19,\nIFERROR(\n   INDEX($H$19:$H$80,\n      _xlfn.AGGREGATE(15,6,\n         (ROW($H$19:$H$80)-ROW($H$19)+1)/($H$19:$H$80<>\"\"),\n         ROW()-ROW($B$19)+1\n      )\n   ),\n\"\"))","v":""},{"$f":"IF($F$18<>\"\",\n\"\",\nIF(ROW()-ROW($C$19)+1<=ROWS('Ações gerais'!$A$4:$A$203),\n   INDEX('Ações gerais'!$A$4:$A$203, ROW()-ROW($C$19)+1),\n   INDEX(Operacionalização!$A$4:$A$93, ROW()-ROW($C$19)+1 - ROWS('Ações gerais'!$A$4:$A$203))\n))","v":0},null,{"$f":"IF($F$18<>\"\",\n\"\",\nIF(OR($C31=\"\",$C31=0),\n   \"\",\n   IF(COUNTIF($C$19:C31,C31)=1,C31,\"\")\n))","v":""},null,{"$f":"IF($F$19<>\"\",\n\"\",\nIF('Ações Cultura Viva'!B16=\"\",\n   \"\",\n   'Ações Cultura Viva'!B16\n))","v":""},{"$f":"IF($F$19<>\"\",\n\"\",\nIF(G31=\"\",\n   \"\",\n   IF(COUNTIF($G$19:G31,G31)=1,G31,\"\")\n))","v":""}]
[{"$f":"IF($F$18<>\"\",\n$F$18,\nIFERROR(\n   INDEX($E$19:$E$308,\n      _xlfn.AGGREGATE(15,6,\n         (ROW($E$19:$E$308)-ROW($E$19)+1)/($E$19:$E$308<>\"\"),\n         ROW()-ROW($A$19)+1\n      )\n   ),\n\"\"))","v":""},{"$f":"IF($F$19<>\"\",\n$F$19,\nIFERROR(\n   INDEX($H$19:$H$80,\n      _xlfn.AGGREGATE(15,6,\n         (ROW($H$19:$H$80)-ROW($H$19)+1)/($H$19:$H$80<>\"\"),\n         ROW()-ROW($B$19)+1\n      )\n   ),\n\"\"))","v":""},{"$f":"IF($F$18<>\"\",\n\"\",\nIF(ROW()-ROW($C$19)+1<=ROWS('Ações gerais'!$A$4:$A$203),\n   INDEX('Ações gerais'!$A$4:$A$203, ROW()-ROW($C$19)+1),\n   INDEX(Operacionalização!$A$4:$A$93, ROW()-ROW($C$19)+1 - ROWS('Ações gerais'!$A$4:$A$203))\n))","v":0},null,{"$f":"IF($F$18<>\"\",\n\"\",\nIF(OR($C32=\"\",$C32=0),\n   \"\",\n   IF(COUNTIF($C$19:C32,C32)=1,C32,\"\")\n))","v":""},null,{"$f":"IF($F$19<>\"\",\n\"\",\nIF('Ações Cultura Viva'!B17=\"\",\n   \"\",\n   'Ações Cultura Viva'!B17\n))","v":""},{"$f":"IF($F$19<>\"\",\n\"\",\nIF(G32=\"\",\n   \"\",\n   IF(COUNTIF($G$19:G32,G32)=1,G32,\"\")\n))","v":""}]
[{"$f":"IF($F$18<>\"\",\n$F$18,\nIFERROR(\n   INDEX($E$19:$E$308,\n      _xlfn.AGGREGATE(15,6,\n         (ROW($E$19:$E$308)-ROW($E$19)+1)/($E$19:$E$308<>\"\"),\n         ROW()-ROW($A$19)+1\n      )\n   ),\n\"\"))","v":""},{"$f":"IF($F$19<>\"\",\n$F$19,\nIFERROR(\n   INDEX($H$19:$H$80,\n      _xlfn.AGGREGATE(15,6,\n         (ROW($H$19:$H$80)-ROW($H$19)+1)/($H$19:$H$80<>\"\"),\n         ROW()-ROW($B$19)+1\n      )\n   ),\n\"\"))","v":""},{"$f":"IF($F$18<>\"\",\n\"\",\nIF(ROW()-ROW($C$19)+1<=ROWS('Ações gerais'!$A$4:$A$203),\n   INDEX('Ações gerais'!$A$4:$A$203, ROW()-ROW($C$19)+1),\n   INDEX(Operacionalização!$A$4:$A$93, ROW()-ROW($C$19)+1 - ROWS('Ações gerais'!$A$4:$A$203))\n))","v":0},null,{"$f":"IF($F$18<>\"\",\n\"\",\nIF(OR($C33=\"\",$C33=0),\n   \"\",\n   IF(COUNTIF($C$19:C33,C33)=1,C33,\"\")\n))","v":""},null,{"$f":"IF($F$19<>\"\",\n\"\",\nIF('Ações Cultura Viva'!B18=\"\",\n   \"\",\n   'Ações Cultura Viva'!B18\n))","v":""},{"$f":"IF($F$19<>\"\",\n\"\",\nIF(G33=\"\",\n   \"\",\n   IF(COUNTIF($G$19:G33,G33)=1,G33,\"\")\n))","v":""}]
[{"$f":"IF($F$18<>\"\",\n$F$18,\nIFERROR(\n   INDEX($E$19:$E$308,\n      _xlfn.AGGREGATE(15,6,\n         (ROW($E$19:$E$308)-ROW($E$19)+1)/($E$19:$E$308<>\"\"),\n         ROW()-ROW($A$19)+1\n      )\n   ),\n\"\"))","v":""},{"$f":"IF($F$19<>\"\",\n$F$19,\nIFERROR(\n   INDEX($H$19:$H$80,\n      _xlfn.AGGREGATE(15,6,\n         (ROW($H$19:$H$80)-ROW($H$19)+1)/($H$19:$H$80<>\"\"),\n         ROW()-ROW($B$19)+1\n      )\n   ),\n\"\"))","v":""},{"$f":"IF($F$18<>\"\",\n\"\",\nIF(ROW()-ROW($C$19)+1<=ROWS('Ações gerais'!$A$4:$A$203),\n   INDEX('Ações gerais'!$A$4:$A$203, ROW()-ROW($C$19)+1),\n   INDEX(Operacionalização!$A$4:$A$93, ROW()-ROW($C$19)+1 - ROWS('Ações gerais'!$A$4:$A$203))\n))","v":0},null,{"$f":"IF($F$18<>\"\",\n\"\",\nIF(OR($C34=\"\",$C34=0),\n   \"\",\n   IF(COUNTIF($C$19:C34,C34)=1,C34,\"\")\n))","v":""},null,{"$f":"IF($F$19<>\"\",\n\"\",\nIF('Ações Cultura Viva'!B19=\"\",\n   \"\",\n   'Ações Cultura Viva'!B19\n))","v":""},{"$f":"IF($F$19<>\"\",\n\"\",\nIF(G34=\"\",\n   \"\",\n   IF(COUNTIF($G$19:G34,G34)=1,G34,\"\")\n))","v":""}]
[{"$f":"IF($F$18<>\"\",\n$F$18,\nIFERROR(\n   INDEX($E$19:$E$308,\n      _xlfn.AGGREGATE(15,6,\n         (ROW($E$19:$E$308)-ROW($E$19)+1)/($E$19:$E$308<>\"\"),\n         ROW()-ROW($A$19)+1\n      )\n   ),\n\"\"))","v":""},{"$f":"IF($F$19<>\"\",\n$F$19,\nIFERROR(\n   INDEX($H$19:$H$80,\n      _xlfn.AGGREGATE(15,6,\n         (ROW($H$19:$H$80)-ROW($H$19)+1)/($H$19:$H$80<>\"\"),\n         ROW()-ROW($B$19)+1\n      )\n   ),\n\"\"))","v":""},{"$f":"IF($F$18<>\"\",\n\"\",\nIF(ROW()-ROW($C$19)+1<=ROWS('Ações gerais'!$A$4:$A$203),\n   INDEX('Ações gerais'!$A$4:$A$203, ROW()-ROW($C$19)+1),\n   INDEX(Operacionalização!$A$4:$A$93, ROW()-ROW($C$19)+1 - ROWS('Ações gerais'!$A$4:$A$203))\n))","v":0},null,{"$f":"IF($F$18<>\"\",\n\"\",\nIF(OR($C35=\"\",$C35=0),\n   \"\",\n   IF(COUNTIF($C$19:C35,C35)=1,C35,\"\")\n))","v":""},null,{"$f":"IF($F$19<>\"\",\n\"\",\nIF('Ações Cultura Viva'!B20=\"\",\n   \"\",\n   'Ações Cultura Viva'!B20\n))","v":""},{"$f":"IF($F$19<>\"\",\n\"\",\nIF(G35=\"\",\n   \"\",\n   IF(COUNTIF($G$19:G35,G35)=1,G35,\"\")\n))","v":""}]
[{"$f":"IF($F$18<>\"\",\n$F$18,\nIFERROR(\n   INDEX($E$19:$E$308,\n      _xlfn.AGGREGATE(15,6,\n         (ROW($E$19:$E$308)-ROW($E$19)+1)/($E$19:$E$308<>\"\"),\n         ROW()-ROW($A$19)+1\n      )\n   ),\n\"\"))","v":""},{"$f":"IF($F$19<>\"\",\n$F$19,\nIFERROR(\n   INDEX($H$19:$H$80,\n      _xlfn.AGGREGATE(15,6,\n         (ROW($H$19:$H$80)-ROW($H$19)+1)/($H$19:$H$80<>\"\"),\n         ROW()-ROW($B$19)+1\n      )\n   ),\n\"\"))","v":""},{"$f":"IF($F$18<>\"\",\n\"\",\nIF(ROW()-ROW($C$19)+1<=ROWS('Ações gerais'!$A$4:$A$203),\n   INDEX('Ações gerais'!$A$4:$A$203, ROW()-ROW($C$19)+1),\n   INDEX(Operacionalização!$A$4:$A$93, ROW()-ROW($C$19)+1 - ROWS('Ações gerais'!$A$4:$A$203))\n))","v":0},null,{"$f":"IF($F$18<>\"\",\n\"\",\nIF(OR($C36=\"\",$C36=0),\n   \"\",\n   IF(COUNTIF($C$19:C36,C36)=1,C36,\"\")\n))","v":""},null,{"$f":"IF($F$19<>\"\",\n\"\",\nIF('Ações Cultura Viva'!B21=\"\",\n   \"\",\n   'Ações Cultura Viva'!B21\n))","v":""},{"$f":"IF($F$19<>\"\",\n\"\",\nIF(G36=\"\",\n   \"\",\n   IF(COUNTIF($G$19:G36,G36)=1,G36,\"\")\n))","v":""}]
[{"$f":"IF($F$18<>\"\",\n$F$18,\nIFERROR(\n   INDEX($E$19:$E$308,\n      _xlfn.AGGREGATE(15,6,\n         (ROW($E$19:$E$308)-ROW($E$19)+1)/($E$19:$E$308<>\"\"),\n         ROW()-ROW($A$19)+1\n      )\n   ),\n\"\"))","v":""},{"$f":"IF($F$19<>\"\",\n$F$19,\nIFERROR(\n   INDEX($H$19:$H$80,\n      _xlfn.AGGREGATE(15,6,\n         (ROW($H$19:$H$80)-ROW($H$19)+1)/($H$19:$H$80<>\"\"),\n         ROW()-ROW($B$19)+1\n      )\n   ),\n\"\"))","v":""},{"$f":"IF($F$18<>\"\",\n\"\",\nIF(ROW()-ROW($C$19)+1<=ROWS('Ações gerais'!$A$4:$A$203),\n   INDEX('Ações gerais'!$A$4:$A$203, ROW()-ROW($C$19)+1),\n   INDEX(Operacionalização!$A$4:$A$93, ROW()-ROW($C$19)+1 - ROWS('Ações gerais'!$A$4:$A$203))\n))","v":0},null,{"$f":"IF($F$18<>\"\",\n\"\",\nIF(OR($C37=\"\",$C37=0),\n   \"\",\n   IF(COUNTIF($C$19:C37,C37)=1,C37,\"\")\n))","v":""},null,{"$f":"IF($F$19<>\"\",\n\"\",\nIF('Ações Cultura Viva'!B22=\"\",\n   \"\",\n   'Ações Cultura Viva'!B22\n))","v":""},{"$f":"IF($F$19<>\"\",\n\"\",\nIF(G37=\"\",\n   \"\",\n   IF(COUNTIF($G$19:G37,G37)=1,G37,\"\")\n))","v":""}]
[{"$f":"IF($F$18<>\"\",\n$F$18,\nIFERROR(\n   INDEX($E$19:$E$308,\n      _xlfn.AGGREGATE(15,6,\n         (ROW($E$19:$E$308)-ROW($E$19)+1)/($E$19:$E$308<>\"\"),\n         ROW()-ROW($A$19)+1\n      )\n   ),\n\"\"))","v":""},{"$f":"IF($F$19<>\"\",\n$F$19,\nIFERROR(\n   INDEX($H$19:$H$80,\n      _xlfn.AGGREGATE(15,6,\n         (ROW($H$19:$H$80)-ROW($H$19)+1)/($H$19:$H$80<>\"\"),\n         ROW()-ROW($B$19)+1\n      )\n   ),\n\"\"))","v":""},{"$f":"IF($F$18<>\"\",\n\"\",\nIF(ROW()-ROW($C$19)+1<=ROWS('Ações gerais'!$A$4:$A$203),\n   INDEX('Ações gerais'!$A$4:$A$203, ROW()-ROW($C$19)+1),\n   INDEX(Operacionalização!$A$4:$A$93, ROW()-ROW($C$19)+1 - ROWS('Ações gerais'!$A$4:$A$203))\n))","v":0},null,{"$f":"IF($F$18<>\"\",\n\"\",\nIF(OR($C38=\"\",$C38=0),\n   \"\",\n   IF(COUNTIF($C$19:C38,C38)=1,C38,\"\")\n))","v":""},null,{"$f":"IF($F$19<>\"\",\n\"\",\nIF('Ações Cultura Viva'!B23=\"\",\n   \"\",\n   'Ações Cultura Viva'!B23\n))","v":""},{"$f":"IF($F$19<>\"\",\n\"\",\nIF(G38=\"\",\n   \"\",\n   IF(COUNTIF($G$19:G38,G38)=1,G38,\"\")\n))","v":""}]
[{"$f":"IF($F$18<>\"\",\n$F$18,\nIFERROR(\n   INDEX($E$19:$E$308,\n      _xlfn.AGGREGATE(15,6,\n         (ROW($E$19:$E$308)-ROW($E$19)+1)/($E$19:$E$308<>\"\"),\n         ROW()-ROW($A$19)+1\n      )\n   ),\n\"\"))","v":""},{"$f":"IF($F$19<>\"\",\n$F$19,\nIFERROR(\n   INDEX($H$19:$H$80,\n      _xlfn.AGGREGATE(15,6,\n         (ROW($H$19:$H$80)-ROW($H$19)+1)/($H$19:$H$80<>\"\"),\n         ROW()-ROW($B$19)+1\n      )\n   ),\n\"\"))","v":""},{"$f":"IF($F$18<>\"\",\n\"\",\nIF(ROW()-ROW($C$19)+1<=ROWS('Ações gerais'!$A$4:$A$203),\n   INDEX('Ações gerais'!$A$4:$A$203, ROW()-ROW($C$19)+1),\n   INDEX(Operacionalização!$A$4:$A$93, ROW()-ROW($C$19)+1 - ROWS('Ações gerais'!$A$4:$A$203))\n))","v":0},null,{"$f":"IF($F$18<>\"\",\n\"\",\nIF(OR($C39=\"\",$C39=0),\n   \"\",\n   IF(COUNTIF($C$19:C39,C39)=1,C39,\"\")\n))","v":""},null,{"$f":"IF($F$19<>\"\",\n\"\",\nIF('Ações Cultura Viva'!B24=\"\",\n   \"\",\n   'Ações Cultura Viva'!B24\n))","v":""},{"$f":"IF($F$19<>\"\",\n\"\",\nIF(G39=\"\",\n   \"\",\n   IF(COUNTIF($G$19:G39,G39)=1,G39,\"\")\n))","v":""}]
[{"$f":"IF($F$18<>\"\",\n$F$18,\nIFERROR(\n   INDEX($E$19:$E$308,\n      _xlfn.AGGREGATE(15,6,\n         (ROW($E$19:$E$308)-ROW($E$19)+1)/($E$19:$E$308<>\"\"),\n         ROW()-ROW($A$19)+1\n      )\n   ),\n\"\"))","v":""},{"$f":"IF($F$19<>\"\",\n$F$19,\nIFERROR(\n   INDEX($H$19:$H$80,\n      _xlfn.AGGREGATE(15,6,\n         (ROW($H$19:$H$80)-ROW($H$19)+1)/($H$19:$H$80<>\"\"),\n         ROW()-ROW($B$19)+1\n      )\n   ),\n\"\"))","v":""},{"$f":"IF($F$18<>\"\",\n\"\",\nIF(ROW()-ROW($C$19)+1<=ROWS('Ações gerais'!$A$4:$A$203),\n   INDEX('Ações gerais'!$A$4:$A$203, ROW()-ROW($C$19)+1),\n   INDEX(Operacionalização!$A$4:$A$93, ROW()-ROW($C$19)+1 - ROWS('Ações gerais'!$A$4:$A$203))\n))","v":0},null,{"$f":"IF($F$18<>\"\",\n\"\",\nIF(OR($C40=\"\",$C40=0),\n   \"\",\n   IF(COUNTIF($C$19:C40,C40)=1,C40,\"\")\n))","v":""},null,{"$f":"IF($F$19<>\"\",\n\"\",\nIF('Ações Cultura Viva'!B25=\"\",\n   \"\",\n   'Ações Cultura Viva'!B25\n))","v":""},{"$f":"IF($F$19<>\"\",\n\"\",\nIF(G40=\"\",\n   \"\",\n   IF(COUNTIF($G$19:G40,G40)=1,G40,\"\")\n))","v":""}]
[{"$f":"IF($F$18<>\"\",\n$F$18,\nIFERROR(\n   INDEX($E$19:$E$308,\n      _xlfn.AGGREGATE(15,6,\n         (ROW($E$19:$E$308)-ROW($E$19)+1)/($E$19:$E$308<>\"\"),\n         ROW()-ROW($A$19)+1\n      )\n   ),\n\"\"))","v":""},{"$f":"IF($F$19<>\"\",\n$F$19,\nIFERROR(\n   INDEX($H$19:$H$80,\n      _xlfn.AGGREGATE(15,6,\n         (ROW($H$19:$H$80)-ROW($H$19)+1)/($H$19:$H$80<>\"\"),\n         ROW()-ROW($B$19)+1\n      )\n   ),\n\"\"))","v":""},{"$f":"IF($F$18<>\"\",\n\"\",\nIF(ROW()-ROW($C$19)+1<=ROWS('Ações gerais'!$A$4:$A$203),\n   INDEX('Ações gerais'!$A$4:$A$203, ROW()-ROW($C$19)+1),\n   INDEX(Operacionalização!$A$4:$A$93, ROW()-ROW($C$19)+1 - ROWS('Ações gerais'!$A$4:$A$203))\n))","v":0},null,{"$f":"IF($F$18<>\"\",\n\"\",\nIF(OR($C41=\"\",$C41=0),\n   \"\",\n   IF(COUNTIF($C$19:C41,C41)=1,C41,\"\")\n))","v":""},null,{"$f":"IF($F$19<>\"\",\n\"\",\nIF('Ações Cultura Viva'!B26=\"\",\n   \"\",\n   'Ações Cultura Viva'!B26\n))","v":""},{"$f":"IF($F$19<>\"\",\n\"\",\nIF(G41=\"\",\n   \"\",\n   IF(COUNTIF($G$19:G41,G41)=1,G41,\"\")\n))","v":""}]
[{"$f":"IF($F$18<>\"\",\n$F$18,\nIFERROR(\n   INDEX($E$19:$E$308,\n      _xlfn.AGGREGATE(15,6,\n         (ROW($E$19:$E$308)-ROW($E$19)+1)/($E$19:$E$308<>\"\"),\n         ROW()-ROW($A$19)+1\n      )\n   ),\n\"\"))","v":""},{"$f":"IF($F$19<>\"\",\n$F$19,\nIFERROR(\n   INDEX($H$19:$H$80,\n      _xlfn.AGGREGATE(15,6,\n         (ROW($H$19:$H$80)-ROW($H$19)+1)/($H$19:$H$80<>\"\"),\n         ROW()-ROW($B$19)+1\n      )\n   ),\n\"\"))","v":""},{"$f":"IF($F$18<>\"\",\n\"\",\nIF(ROW()-ROW($C$19)+1<=ROWS('Ações gerais'!$A$4:$A$203),\n   INDEX('Ações gerais'!$A$4:$A$203, ROW()-ROW($C$19)+1),\n   INDEX(Operacionalização!$A$4:$A$93, ROW()-ROW($C$19)+1 - ROWS('Ações gerais'!$A$4:$A$203))\n))","v":0},null,{"$f":"IF($F$18<>\"\",\n\"\",\nIF(OR($C42=\"\",$C42=0),\n   \"\",\n   IF(COUNTIF($C$19:C42,C42)=1,C42,\"\")\n))","v":""},null,{"$f":"IF($F$19<>\"\",\n\"\",\nIF('Ações Cultura Viva'!B27=\"\",\n   \"\",\n   'Ações Cultura Viva'!B27\n))","v":""},{"$f":"IF($F$19<>\"\",\n\"\",\nIF(G42=\"\",\n   \"\",\n   IF(COUNTIF($G$19:G42,G42)=1,G42,\"\")\n))","v":""}]
[{"$f":"IF($F$18<>\"\",\n$F$18,\nIFERROR(\n   INDEX($E$19:$E$308,\n      _xlfn.AGGREGATE(15,6,\n         (ROW($E$19:$E$308)-ROW($E$19)+1)/($E$19:$E$308<>\"\"),\n         ROW()-ROW($A$19)+1\n      )\n   ),\n\"\"))","v":""},{"$f":"IF($F$19<>\"\",\n$F$19,\nIFERROR(\n   INDEX($H$19:$H$80,\n      _xlfn.AGGREGATE(15,6,\n         (ROW($H$19:$H$80)-ROW($H$19)+1)/($H$19:$H$80<>\"\"),\n         ROW()-ROW($B$19)+1\n      )\n   ),\n\"\"))","v":""},{"$f":"IF($F$18<>\"\",\n\"\",\nIF(ROW()-ROW($C$19)+1<=ROWS('Ações gerais'!$A$4:$A$203),\n   INDEX('Ações gerais'!$A$4:$A$203, ROW()-ROW($C$19)+1),\n   INDEX(Operacionalização!$A$4:$A$93, ROW()-ROW($C$19)+1 - ROWS('Ações gerais'!$A$4:$A$203))\n))","v":0},null,{"$f":"IF($F$18<>\"\",\n\"\",\nIF(OR($C43=\"\",$C43=0),\n   \"\",\n   IF(COUNTIF($C$19:C43,C43)=1,C43,\"\")\n))","v":""},null,{"$f":"IF($F$19<>\"\",\n\"\",\nIF('Ações Cultura Viva'!B28=\"\",\n   \"\",\n   'Ações Cultura Viva'!B28\n))","v":""},{"$f":"IF($F$19<>\"\",\n\"\",\nIF(G43=\"\",\n   \"\",\n   IF(COUNTIF($G$19:G43,G43)=1,G43,\"\")\n))","v":""}]
[{"$f":"IF($F$18<>\"\",\n$F$18,\nIFERROR(\n   INDEX($E$19:$E$308,\n      _xlfn.AGGREGATE(15,6,\n         (ROW($E$19:$E$308)-ROW($E$19)+1)/($E$19:$E$308<>\"\"),\n         ROW()-ROW($A$19)+1\n      )\n   ),\n\"\"))","v":""},{"$f":"IF($F$19<>\"\",\n$F$19,\nIFERROR(\n   INDEX($H$19:$H$80,\n      _xlfn.AGGREGATE(15,6,\n         (ROW($H$19:$H$80)-ROW($H$19)+1)/($H$19:$H$80<>\"\"),\n         ROW()-ROW($B$19)+1\n      )\n   ),\n\"\"))","v":""},{"$f":"IF($F$18<>\"\",\n\"\",\nIF(ROW()-ROW($C$19)+1<=ROWS('Ações gerais'!$A$4:$A$203),\n   INDEX('Ações gerais'!$A$4:$A$203, ROW()-ROW($C$19)+1),\n   INDEX(Operacionalização!$A$4:$A$93, ROW()-ROW($C$19)+1 - ROWS('Ações gerais'!$A$4:$A$203))\n))","v":0},null,{"$f":"IF($F$18<>\"\",\n\"\",\nIF(OR($C44=\"\",$C44=0),\n   \"\",\n   IF(COUNTIF($C$19:C44,C44)=1,C44,\"\")\n))","v":""},null,{"$f":"IF($F$19<>\"\",\n\"\",\nIF('Ações Cultura Viva'!B29=\"\",\n   \"\",\n   'Ações Cultura Viva'!B29\n))","v":""},{"$f":"IF($F$19<>\"\",\n\"\",\nIF(G44=\"\",\n   \"\",\n   IF(COUNTIF($G$19:G44,G44)=1,G44,\"\")\n))","v":""}]
[{"$f":"IF($F$18<>\"\",\n$F$18,\nIFERROR(\n   INDEX($E$19:$E$308,\n      _xlfn.AGGREGATE(15,6,\n         (ROW($E$19:$E$308)-ROW($E$19)+1)/($E$19:$E$308<>\"\"),\n         ROW()-ROW($A$19)+1\n      )\n   ),\n\"\"))","v":""},{"$f":"IF($F$19<>\"\",\n$F$19,\nIFERROR(\n   INDEX($H$19:$H$80,\n      _xlfn.AGGREGATE(15,6,\n         (ROW($H$19:$H$80)-ROW($H$19)+1)/($H$19:$H$80<>\"\"),\n         ROW()-ROW($B$19)+1\n      )\n   ),\n\"\"))","v":""},{"$f":"IF($F$18<>\"\",\n\"\",\nIF(ROW()-ROW($C$19)+1<=ROWS('Ações gerais'!$A$4:$A$203),\n   INDEX('Ações gerais'!$A$4:$A$203, ROW()-ROW($C$19)+1),\n   INDEX(Operacionalização!$A$4:$A$93, ROW()-ROW($C$19)+1 - ROWS('Ações gerais'!$A$4:$A$203))\n))","v":0},null,{"$f":"IF($F$18<>\"\",\n\"\",\nIF(OR($C45=\"\",$C45=0),\n   \"\",\n   IF(COUNTIF($C$19:C45,C45)=1,C45,\"\")\n))","v":""},null,{"$f":"IF($F$19<>\"\",\n\"\",\nIF('Ações Cultura Viva'!B30=\"\",\n   \"\",\n   'Ações Cultura Viva'!B30\n))","v":""},{"$f":"IF($F$19<>\"\",\n\"\",\nIF(G45=\"\",\n   \"\",\n   IF(COUNTIF($G$19:G45,G45)=1,G45,\"\")\n))","v":""}]
[{"$f":"IF($F$18<>\"\",\n$F$18,\nIFERROR(\n   INDEX($E$19:$E$308,\n      _xlfn.AGGREGATE(15,6,\n         (ROW($E$19:$E$308)-ROW($E$19)+1)/($E$19:$E$308<>\"\"),\n         ROW()-ROW($A$19)+1\n      )\n   ),\n\"\"))","v":""},{"$f":"IF($F$19<>\"\",\n$F$19,\nIFERROR(\n   INDEX($H$19:$H$80,\n      _xlfn.AGGREGATE(15,6,\n         (ROW($H$19:$H$80)-ROW($H$19)+1)/($H$19:$H$80<>\"\"),\n         ROW()-ROW($B$19)+1\n      )\n   ),\n\"\"))","v":""},{"$f":"IF($F$18<>\"\",\n\"\",\nIF(ROW()-ROW($C$19)+1<=ROWS('Ações gerais'!$A$4:$A$203),\n   INDEX('Ações gerais'!$A$4:$A$203, ROW()-ROW($C$19)+1),\n   INDEX(Operacionalização!$A$4:$A$93, ROW()-ROW($C$19)+1 - ROWS('Ações gerais'!$A$4:$A$203))\n))","v":0},null,{"$f":"IF($F$18<>\"\",\n\"\",\nIF(OR($C46=\"\",$C46=0),\n   \"\",\n   IF(COUNTIF($C$19:C46,C46)=1,C46,\"\")\n))","v":""},null,{"$f":"IF($F$19<>\"\",\n\"\",\nIF('Ações Cultura Viva'!B31=\"\",\n   \"\",\n   'Ações Cultura Viva'!B31\n))","v":""},{"$f":"IF($F$19<>\"\",\n\"\",\nIF(G46=\"\",\n   \"\",\n   IF(COUNTIF($G$19:G46,G46)=1,G46,\"\")\n))","v":""}]
[{"$f":"IF($F$18<>\"\",\n$F$18,\nIFERROR(\n   INDEX($E$19:$E$308,\n      _xlfn.AGGREGATE(15,6,\n         (ROW($E$19:$E$308)-ROW($E$19)+1)/($E$19:$E$308<>\"\"),\n         ROW()-ROW($A$19)+1\n      )\n   ),\n\"\"))","v":""},{"$f":"IF($F$19<>\"\",\n$F$19,\nIFERROR(\n   INDEX($H$19:$H$80,\n      _xlfn.AGGREGATE(15,6,\n         (ROW($H$19:$H$80)-ROW($H$19)+1)/($H$19:$H$80<>\"\"),\n         ROW()-ROW($B$19)+1\n      )\n   ),\n\"\"))","v":""},{"$f":"IF($F$18<>\"\",\n\"\",\nIF(ROW()-ROW($C$19)+1<=ROWS('Ações gerais'!$A$4:$A$203),\n   INDEX('Ações gerais'!$A$4:$A$203, ROW()-ROW($C$19)+1),\n   INDEX(Operacionalização!$A$4:$A$93, ROW()-ROW($C$19)+1 - ROWS('Ações gerais'!$A$4:$A$203))\n))","v":0},null,{"$f":"IF($F$18<>\"\",\n\"\",\nIF(OR($C47=\"\",$C47=0),\n   \"\",\n   IF(COUNTIF($C$19:C47,C47)=1,C47,\"\")\n))","v":""},null,{"$f":"IF($F$19<>\"\",\n\"\",\nIF('Ações Cultura Viva'!B32=\"\",\n   \"\",\n   'Ações Cultura Viva'!B32\n))","v":""},{"$f":"IF($F$19<>\"\",\n\"\",\nIF(G47=\"\",\n   \"\",\n   IF(COUNTIF($G$19:G47,G47)=1,G47,\"\")\n))","v":""}]
[{"$f":"IF($F$18<>\"\",\n$F$18,\nIFERROR(\n   INDEX($E$19:$E$308,\n      _xlfn.AGGREGATE(15,6,\n         (ROW($E$19:$E$308)-ROW($E$19)+1)/($E$19:$E$308<>\"\"),\n         ROW()-ROW($A$19)+1\n      )\n   ),\n\"\"))","v":""},{"$f":"IF($F$19<>\"\",\n$F$19,\nIFERROR(\n   INDEX($H$19:$H$80,\n      _xlfn.AGGREGATE(15,6,\n         (ROW($H$19:$H$80)-ROW($H$19)+1)/($H$19:$H$80<>\"\"),\n         ROW()-ROW($B$19)+1\n      )\n   ),\n\"\"))","v":""},{"$f":"IF($F$18<>\"\",\n\"\",\nIF(ROW()-ROW($C$19)+1<=ROWS('Ações gerais'!$A$4:$A$203),\n   INDEX('Ações gerais'!$A$4:$A$203, ROW()-ROW($C$19)+1),\n   INDEX(Operacionalização!$A$4:$A$93, ROW()-ROW($C$19)+1 - ROWS('Ações gerais'!$A$4:$A$203))\n))","v":0},null,{"$f":"IF($F$18<>\"\",\n\"\",\nIF(OR($C48=\"\",$C48=0),\n   \"\",\n   IF(COUNTIF($C$19:C48,C48)=1,C48,\"\")\n))","v":""},null,{"$f":"IF($F$19<>\"\",\n\"\",\nIF('Ações Cultura Viva'!B33=\"\",\n   \"\",\n   'Ações Cultura Viva'!B33\n))","v":""},{"$f":"IF($F$19<>\"\",\n\"\",\nIF(G48=\"\",\n   \"\",\n   IF(COUNTIF($G$19:G48,G48)=1,G48,\"\")\n))","v":""}]
[{"$f":"IF($F$18<>\"\",\n$F$18,\nIFERROR(\n   INDEX($E$19:$E$308,\n      _xlfn.AGGREGATE(15,6,\n         (ROW($E$19:$E$308)-ROW($E$19)+1)/($E$19:$E$308<>\"\"),\n         ROW()-ROW($A$19)+1\n      )\n   ),\n\"\"))","v":""},{"$f":"IF($F$19<>\"\",\n$F$19,\nIFERROR(\n   INDEX($H$19:$H$80,\n      _xlfn.AGGREGATE(15,6,\n         (ROW($H$19:$H$80)-ROW($H$19)+1)/($H$19:$H$80<>\"\"),\n         ROW()-ROW($B$19)+1\n      )\n   ),\n\"\"))","v":""},{"$f":"IF($F$18<>\"\",\n\"\",\nIF(ROW()-ROW($C$19)+1<=ROWS('Ações gerais'!$A$4:$A$203),\n   INDEX('Ações gerais'!$A$4:$A$203, ROW()-ROW($C$19)+1),\n   INDEX(Operacionalização!$A$4:$A$93, ROW()-ROW($C$19)+1 - ROWS('Ações gerais'!$A$4:$A$203))\n))","v":0},null,{"$f":"IF($F$18<>\"\",\n\"\",\nIF(OR($C49=\"\",$C49=0),\n   \"\",\n   IF(COUNTIF($C$19:C49,C49)=1,C49,\"\")\n))","v":""},null,{"$f":"IF($F$19<>\"\",\n\"\",\nIF('Ações Cultura Viva'!B34=\"\",\n   \"\",\n   'Ações Cultura Viva'!B34\n))","v":""},{"$f":"IF($F$19<>\"\",\n\"\",\nIF(G49=\"\",\n   \"\",\n   IF(COUNTIF($G$19:G49,G49)=1,G49,\"\")\n))","v":""}]
[{"$f":"IF($F$18<>\"\",\n$F$18,\nIFERROR(\n   INDEX($E$19:$E$308,\n      _xlfn.AGGREGATE(15,6,\n         (ROW($E$19:$E$308)-ROW($E$19)+1)/($E$19:$E$308<>\"\"),\n         ROW()-ROW($A$19)+1\n      )\n   ),\n\"\"))","v":""},{"$f":"IF($F$19<>\"\",\n$F$19,\nIFERROR(\n   INDEX($H$19:$H$80,\n      _xlfn.AGGREGATE(15,6,\n         (ROW($H$19:$H$80)-ROW($H$19)+1)/($H$19:$H$80<>\"\"),\n         ROW()-ROW($B$19)+1\n      )\n   ),\n\"\"))","v":""},{"$f":"IF($F$18<>\"\",\n\"\",\nIF(ROW()-ROW($C$19)+1<=ROWS('Ações gerais'!$A$4:$A$203),\n   INDEX('Ações gerais'!$A$4:$A$203, ROW()-ROW($C$19)+1),\n   INDEX(Operacionalização!$A$4:$A$93, ROW()-ROW($C$19)+1 - ROWS('Ações gerais'!$A$4:$A$203))\n))","v":0},null,{"$f":"IF($F$18<>\"\",\n\"\",\nIF(OR($C50=\"\",$C50=0),\n   \"\",\n   IF(COUNTIF($C$19:C50,C50)=1,C50,\"\")\n))","v":""},null,{"$f":"IF($F$19<>\"\",\n\"\",\nIF('Ações Cultura Viva'!B35=\"\",\n   \"\",\n   'Ações Cultura Viva'!B35\n))","v":""},{"$f":"IF($F$19<>\"\",\n\"\",\nIF(G50=\"\",\n   \"\",\n   IF(COUNTIF($G$19:G50,G50)=1,G50,\"\")\n))","v":""}]
[{"$f":"IF($F$18<>\"\",\n$F$18,\nIFERROR(\n   INDEX($E$19:$E$308,\n      _xlfn.AGGREGATE(15,6,\n         (ROW($E$19:$E$308)-ROW($E$19)+1)/($E$19:$E$308<>\"\"),\n         ROW()-ROW($A$19)+1\n      )\n   ),\n\"\"))","v":""},{"$f":"IF($F$19<>\"\",\n$F$19,\nIFERROR(\n   INDEX($H$19:$H$80,\n      _xlfn.AGGREGATE(15,6,\n         (ROW($H$19:$H$80)-ROW($H$19)+1)/($H$19:$H$80<>\"\"),\n         ROW()-ROW($B$19)+1\n      )\n   ),\n\"\"))","v":""},{"$f":"IF($F$18<>\"\",\n\"\",\nIF(ROW()-ROW($C$19)+1<=ROWS('Ações gerais'!$A$4:$A$203),\n   INDEX('Ações gerais'!$A$4:$A$203, ROW()-ROW($C$19)+1),\n   INDEX(Operacionalização!$A$4:$A$93, ROW()-ROW($C$19)+1 - ROWS('Ações gerais'!$A$4:$A$203))\n))","v":0},null,{"$f":"IF($F$18<>\"\",\n\"\",\nIF(OR($C51=\"\",$C51=0),\n   \"\",\n   IF(COUNTIF($C$19:C51,C51)=1,C51,\"\")\n))","v":""},null,{"$f":"IF($F$19<>\"\",\n\"\",\nIF('Ações Cultura Viva'!B36=\"\",\n   \"\",\n   'Ações Cultura Viva'!B36\n))","v":""},{"$f":"IF($F$19<>\"\",\n\"\",\nIF(G51=\"\",\n   \"\",\n   IF(COUNTIF($G$19:G51,G51)=1,G51,\"\")\n))","v":""}]
[{"$f":"IF($F$18<>\"\",\n$F$18,\nIFERROR(\n   INDEX($E$19:$E$308,\n      _xlfn.AGGREGATE(15,6,\n         (ROW($E$19:$E$308)-ROW($E$19)+1)/($E$19:$E$308<>\"\"),\n         ROW()-ROW($A$19)+1\n      )\n   ),\n\"\"))","v":""},{"$f":"IF($F$19<>\"\",\n$F$19,\nIFERROR(\n   INDEX($H$19:$H$80,\n      _xlfn.AGGREGATE(15,6,\n         (ROW($H$19:$H$80)-ROW($H$19)+1)/($H$19:$H$80<>\"\"),\n         ROW()-ROW($B$19)+1\n      )\n   ),\n\"\"))","v":""},{"$f":"IF($F$18<>\"\",\n\"\",\nIF(ROW()-ROW($C$19)+1<=ROWS('Ações gerais'!$A$4:$A$203),\n   INDEX('Ações gerais'!$A$4:$A$203, ROW()-ROW($C$19)+1),\n   INDEX(Operacionalização!$A$4:$A$93, ROW()-ROW($C$19)+1 - ROWS('Ações gerais'!$A$4:$A$203))\n))","v":0},null,{"$f":"IF($F$18<>\"\",\n\"\",\nIF(OR($C52=\"\",$C52=0),\n   \"\",\n   IF(COUNTIF($C$19:C52,C52)=1,C52,\"\")\n))","v":""},null,{"$f":"IF($F$19<>\"\",\n\"\",\nIF('Ações Cultura Viva'!B37=\"\",\n   \"\",\n   'Ações Cultura Viva'!B37\n))","v":""},{"$f":"IF($F$19<>\"\",\n\"\",\nIF(G52=\"\",\n   \"\",\n   IF(COUNTIF($G$19:G52,G52)=1,G52,\"\")\n))","v":""}]
[{"$f":"IF($F$18<>\"\",\n$F$18,\nIFERROR(\n   INDEX($E$19:$E$308,\n      _xlfn.AGGREGATE(15,6,\n         (ROW($E$19:$E$308)-ROW($E$19)+1)/($E$19:$E$308<>\"\"),\n         ROW()-ROW($A$19)+1\n      )\n   ),\n\"\"))","v":""},{"$f":"IF($F$19<>\"\",\n$F$19,\nIFERROR(\n   INDEX($H$19:$H$80,\n      _xlfn.AGGREGATE(15,6,\n         (ROW($H$19:$H$80)-ROW($H$19)+1)/($H$19:$H$80<>\"\"),\n         ROW()-ROW($B$19)+1\n      )\n   ),\n\"\"))","v":""},{"$f":"IF($F$18<>\"\",\n\"\",\nIF(ROW()-ROW($C$19)+1<=ROWS('Ações gerais'!$A$4:$A$203),\n   INDEX('Ações gerais'!$A$4:$A$203, ROW()-ROW($C$19)+1),\n   INDEX(Operacionalização!$A$4:$A$93, ROW()-ROW($C$19)+1 - ROWS('Ações gerais'!$A$4:$A$203))\n))","v":0},null,{"$f":"IF($F$18<>\"\",\n\"\",\nIF(OR($C53=\"\",$C53=0),\n   \"\",\n   IF(COUNTIF($C$19:C53,C53)=1,C53,\"\")\n))","v":""},null,{"$f":"IF($F$19<>\"\",\n\"\",\nIF('Ações Cultura Viva'!B38=\"\",\n   \"\",\n   'Ações Cultura Viva'!B38\n))","v":""},{"$f":"IF($F$19<>\"\",\n\"\",\nIF(G53=\"\",\n   \"\",\n   IF(COUNTIF($G$19:G53,G53)=1,G53,\"\")\n))","v":""}]
[{"$f":"IF($F$18<>\"\",\n$F$18,\nIFERROR(\n   INDEX($E$19:$E$308,\n      _xlfn.AGGREGATE(15,6,\n         (ROW($E$19:$E$308)-ROW($E$19)+1)/($E$19:$E$308<>\"\"),\n         ROW()-ROW($A$19)+1\n      )\n   ),\n\"\"))","v":""},{"$f":"IF($F$19<>\"\",\n$F$19,\nIFERROR(\n   INDEX($H$19:$H$80,\n      _xlfn.AGGREGATE(15,6,\n         (ROW($H$19:$H$80)-ROW($H$19)+1)/($H$19:$H$80<>\"\"),\n         ROW()-ROW($B$19)+1\n      )\n   ),\n\"\"))","v":""},{"$f":"IF($F$18<>\"\",\n\"\",\nIF(ROW()-ROW($C$19)+1<=ROWS('Ações gerais'!$A$4:$A$203),\n   INDEX('Ações gerais'!$A$4:$A$203, ROW()-ROW($C$19)+1),\n   INDEX(Operacionalização!$A$4:$A$93, ROW()-ROW($C$19)+1 - ROWS('Ações gerais'!$A$4:$A$203))\n))","v":0},null,{"$f":"IF($F$18<>\"\",\n\"\",\nIF(OR($C54=\"\",$C54=0),\n   \"\",\n   IF(COUNTIF($C$19:C54,C54)=1,C54,\"\")\n))","v":""},null,{"$f":"IF($F$19<>\"\",\n\"\",\nIF('Ações Cultura Viva'!B39=\"\",\n   \"\",\n   'Ações Cultura Viva'!B39\n))","v":""},{"$f":"IF($F$19<>\"\",\n\"\",\nIF(G54=\"\",\n   \"\",\n   IF(COUNTIF($G$19:G54,G54)=1,G54,\"\")\n))","v":""}]
[{"$f":"IF($F$18<>\"\",\n$F$18,\nIFERROR(\n   INDEX($E$19:$E$308,\n      _xlfn.AGGREGATE(15,6,\n         (ROW($E$19:$E$308)-ROW($E$19)+1)/($E$19:$E$308<>\"\"),\n         ROW()-ROW($A$19)+1\n      )\n   ),\n\"\"))","v":""},{"$f":"IF($F$19<>\"\",\n$F$19,\nIFERROR(\n   INDEX($H$19:$H$80,\n      _xlfn.AGGREGATE(15,6,\n         (ROW($H$19:$H$80)-ROW($H$19)+1)/($H$19:$H$80<>\"\"),\n         ROW()-ROW($B$19)+1\n      )\n   ),\n\"\"))","v":""},{"$f":"IF($F$18<>\"\",\n\"\",\nIF(ROW()-ROW($C$19)+1<=ROWS('Ações gerais'!$A$4:$A$203),\n   INDEX('Ações gerais'!$A$4:$A$203, ROW()-ROW($C$19)+1),\n   INDEX(Operacionalização!$A$4:$A$93, ROW()-ROW($C$19)+1 - ROWS('Ações gerais'!$A$4:$A$203))\n))","v":0},null,{"$f":"IF($F$18<>\"\",\n\"\",\nIF(OR($C55=\"\",$C55=0),\n   \"\",\n   IF(COUNTIF($C$19:C55,C55)=1,C55,\"\")\n))","v":""},null,{"$f":"IF($F$19<>\"\",\n\"\",\nIF('Ações Cultura Viva'!B40=\"\",\n   \"\",\n   'Ações Cultura Viva'!B40\n))","v":""},{"$f":"IF($F$19<>\"\",\n\"\",\nIF(G55=\"\",\n   \"\",\n   IF(COUNTIF($G$19:G55,G55)=1,G55,\"\")\n))","v":""}]
[{"$f":"IF($F$18<>\"\",\n$F$18,\nIFERROR(\n   INDEX($E$19:$E$308,\n      _xlfn.AGGREGATE(15,6,\n         (ROW($E$19:$E$308)-ROW($E$19)+1)/($E$19:$E$308<>\"\"),\n         ROW()-ROW($A$19)+1\n      )\n   ),\n\"\"))","v":""},{"$f":"IF($F$19<>\"\",\n$F$19,\nIFERROR(\n   INDEX($H$19:$H$80,\n      _xlfn.AGGREGATE(15,6,\n         (ROW($H$19:$H$80)-ROW($H$19)+1)/($H$19:$H$80<>\"\"),\n         ROW()-ROW($B$19)+1\n      )\n   ),\n\"\"))","v":""},{"$f":"IF($F$18<>\"\",\n\"\",\nIF(ROW()-ROW($C$19)+1<=ROWS('Ações gerais'!$A$4:$A$203),\n   INDEX('Ações gerais'!$A$4:$A$203, ROW()-ROW($C$19)+1),\n   INDEX(Operacionalização!$A$4:$A$93, ROW()-ROW($C$19)+1 - ROWS('Ações gerais'!$A$4:$A$203))\n))","v":0},null,{"$f":"IF($F$18<>\"\",\n\"\",\nIF(OR($C56=\"\",$C56=0),\n   \"\",\n   IF(COUNTIF($C$19:C56,C56)=1,C56,\"\")\n))","v":""},null,{"$f":"IF($F$19<>\"\",\n\"\",\nIF('Ações Cultura Viva'!B41=\"\",\n   \"\",\n   'Ações Cultura Viva'!B41\n))","v":""},{"$f":"IF($F$19<>\"\",\n\"\",\nIF(G56=\"\",\n   \"\",\n   IF(COUNTIF($G$19:G56,G56)=1,G56,\"\")\n))","v":""}]
[{"$f":"IF($F$18<>\"\",\n$F$18,\nIFERROR(\n   INDEX($E$19:$E$308,\n      _xlfn.AGGREGATE(15,6,\n         (ROW($E$19:$E$308)-ROW($E$19)+1)/($E$19:$E$308<>\"\"),\n         ROW()-ROW($A$19)+1\n      )\n   ),\n\"\"))","v":""},{"$f":"IF($F$19<>\"\",\n$F$19,\nIFERROR(\n   INDEX($H$19:$H$80,\n      _xlfn.AGGREGATE(15,6,\n         (ROW($H$19:$H$80)-ROW($H$19)+1)/($H$19:$H$80<>\"\"),\n         ROW()-ROW($B$19)+1\n      )\n   ),\n\"\"))","v":""},{"$f":"IF($F$18<>\"\",\n\"\",\nIF(ROW()-ROW($C$19)+1<=ROWS('Ações gerais'!$A$4:$A$203),\n   INDEX('Ações gerais'!$A$4:$A$203, ROW()-ROW($C$19)+1),\n   INDEX(Operacionalização!$A$4:$A$93, ROW()-ROW($C$19)+1 - ROWS('Ações gerais'!$A$4:$A$203))\n))","v":0},null,{"$f":"IF($F$18<>\"\",\n\"\",\nIF(OR($C57=\"\",$C57=0),\n   \"\",\n   IF(COUNTIF($C$19:C57,C57)=1,C57,\"\")\n))","v":""},null,{"$f":"IF($F$19<>\"\",\n\"\",\nIF('Ações Cultura Viva'!B42=\"\",\n   \"\",\n   'Ações Cultura Viva'!B42\n))","v":""},{"$f":"IF($F$19<>\"\",\n\"\",\nIF(G57=\"\",\n   \"\",\n   IF(COUNTIF($G$19:G57,G57)=1,G57,\"\")\n))","v":""}]
[{"$f":"IF($F$18<>\"\",\n$F$18,\nIFERROR(\n   INDEX($E$19:$E$308,\n      _xlfn.AGGREGATE(15,6,\n         (ROW($E$19:$E$308)-ROW($E$19)+1)/($E$19:$E$308<>\"\"),\n         ROW()-ROW($A$19)+1\n      )\n   ),\n\"\"))","v":""},{"$f":"IF($F$19<>\"\",\n$F$19,\nIFERROR(\n   INDEX($H$19:$H$80,\n      _xlfn.AGGREGATE(15,6,\n         (ROW($H$19:$H$80)-ROW($H$19)+1)/($H$19:$H$80<>\"\"),\n         ROW()-ROW($B$19)+1\n      )\n   ),\n\"\"))","v":""},{"$f":"IF($F$18<>\"\",\n\"\",\nIF(ROW()-ROW($C$19)+1<=ROWS('Ações gerais'!$A$4:$A$203),\n   INDEX('Ações gerais'!$A$4:$A$203, ROW()-ROW($C$19)+1),\n   INDEX(Operacionalização!$A$4:$A$93, ROW()-ROW($C$19)+1 - ROWS('Ações gerais'!$A$4:$A$203))\n))","v":0},null,{"$f":"IF($F$18<>\"\",\n\"\",\nIF(OR($C58=\"\",$C58=0),\n   \"\",\n   IF(COUNTIF($C$19:C58,C58)=1,C58,\"\")\n))","v":""},null,{"$f":"IF($F$19<>\"\",\n\"\",\nIF('Ações Cultura Viva'!B43=\"\",\n   \"\",\n   'Ações Cultura Viva'!B43\n))","v":""},{"$f":"IF($F$19<>\"\",\n\"\",\nIF(G58=\"\",\n   \"\",\n   IF(COUNTIF($G$19:G58,G58)=1,G58,\"\")\n))","v":""}]
[{"$f":"IF($F$18<>\"\",\n$F$18,\nIFERROR(\n   INDEX($E$19:$E$308,\n      _xlfn.AGGREGATE(15,6,\n         (ROW($E$19:$E$308)-ROW($E$19)+1)/($E$19:$E$308<>\"\"),\n         ROW()-ROW($A$19)+1\n      )\n   ),\n\"\"))","v":""},{"$f":"IF($F$19<>\"\",\n$F$19,\nIFERROR(\n   INDEX($H$19:$H$80,\n      _xlfn.AGGREGATE(15,6,\n         (ROW($H$19:$H$80)-ROW($H$19)+1)/($H$19:$H$80<>\"\"),\n         ROW()-ROW($B$19)+1\n      )\n   ),\n\"\"))","v":""},{"$f":"IF($F$18<>\"\",\n\"\",\nIF(ROW()-ROW($C$19)+1<=ROWS('Ações gerais'!$A$4:$A$203),\n   INDEX('Ações gerais'!$A$4:$A$203, ROW()-ROW($C$19)+1),\n   INDEX(Operacionalização!$A$4:$A$93, ROW()-ROW($C$19)+1 - ROWS('Ações gerais'!$A$4:$A$203))\n))","v":0},null,{"$f":"IF($F$18<>\"\",\n\"\",\nIF(OR($C59=\"\",$C59=0),\n   \"\",\n   IF(COUNTIF($C$19:C59,C59)=1,C59,\"\")\n))","v":""},null,{"$f":"IF($F$19<>\"\",\n\"\",\nIF('Ações Cultura Viva'!B44=\"\",\n   \"\",\n   'Ações Cultura Viva'!B44\n))","v":""},{"$f":"IF($F$19<>\"\",\n\"\",\nIF(G59=\"\",\n   \"\",\n   IF(COUNTIF($G$19:G59,G59)=1,G59,\"\")\n))","v":""}]
[{"$f":"IF($F$18<>\"\",\n$F$18,\nIFERROR(\n   INDEX($E$19:$E$308,\n      _xlfn.AGGREGATE(15,6,\n         (ROW($E$19:$E$308)-ROW($E$19)+1)/($E$19:$E$308<>\"\"),\n         ROW()-ROW($A$19)+1\n      )\n   ),\n\"\"))","v":""},{"$f":"IF($F$19<>\"\",\n$F$19,\nIFERROR(\n   INDEX($H$19:$H$80,\n      _xlfn.AGGREGATE(15,6,\n         (ROW($H$19:$H$80)-ROW($H$19)+1)/($H$19:$H$80<>\"\"),\n         ROW()-ROW($B$19)+1\n      )\n   ),\n\"\"))","v":""},{"$f":"IF($F$18<>\"\",\n\"\",\nIF(ROW()-ROW($C$19)+1<=ROWS('Ações gerais'!$A$4:$A$203),\n   INDEX('Ações gerais'!$A$4:$A$203, ROW()-ROW($C$19)+1),\n   INDEX(Operacionalização!$A$4:$A$93, ROW()-ROW($C$19)+1 - ROWS('Ações gerais'!$A$4:$A$203))\n))","v":0},null,{"$f":"IF($F$18<>\"\",\n\"\",\nIF(OR($C60=\"\",$C60=0),\n   \"\",\n   IF(COUNTIF($C$19:C60,C60)=1,C60,\"\")\n))","v":""},null,{"$f":"IF($F$19<>\"\",\n\"\",\nIF('Ações Cultura Viva'!B45=\"\",\n   \"\",\n   'Ações Cultura Viva'!B45\n))","v":""},{"$f":"IF($F$19<>\"\",\n\"\",\nIF(G60=\"\",\n   \"\",\n   IF(COUNTIF($G$19:G60,G60)=1,G60,\"\")\n))","v":""}]
[{"$f":"IF($F$18<>\"\",\n$F$18,\nIFERROR(\n   INDEX($E$19:$E$308,\n      _xlfn.AGGREGATE(15,6,\n         (ROW($E$19:$E$308)-ROW($E$19)+1)/($E$19:$E$308<>\"\"),\n         ROW()-ROW($A$19)+1\n      )\n   ),\n\"\"))","v":""},{"$f":"IF($F$19<>\"\",\n$F$19,\nIFERROR(\n   INDEX($H$19:$H$80,\n      _xlfn.AGGREGATE(15,6,\n         (ROW($H$19:$H$80)-ROW($H$19)+1)/($H$19:$H$80<>\"\"),\n         ROW()-ROW($B$19)+1\n      )\n   ),\n\"\"))","v":""},{"$f":"IF($F$18<>\"\",\n\"\",\nIF(ROW()-ROW($C$19)+1<=ROWS('Ações gerais'!$A$4:$A$203),\n   INDEX('Ações gerais'!$A$4:$A$203, ROW()-ROW($C$19)+1),\n   INDEX(Operacionalização!$A$4:$A$93, ROW()-ROW($C$19)+1 - ROWS('Ações gerais'!$A$4:$A$203))\n))","v":0},null,{"$f":"IF($F$18<>\"\",\n\"\",\nIF(OR($C61=\"\",$C61=0),\n   \"\",\n   IF(COUNTIF($C$19:C61,C61)=1,C61,\"\")\n))","v":""},null,{"$f":"IF($F$19<>\"\",\n\"\",\nIF('Ações Cultura Viva'!B46=\"\",\n   \"\",\n   'Ações Cultura Viva'!B46\n))","v":""},{"$f":"IF($F$19<>\"\",\n\"\",\nIF(G61=\"\",\n   \"\",\n   IF(COUNTIF($G$19:G61,G61)=1,G61,\"\")\n))","v":""}]
[{"$f":"IF($F$18<>\"\",\n$F$18,\nIFERROR(\n   INDEX($E$19:$E$308,\n      _xlfn.AGGREGATE(15,6,\n         (ROW($E$19:$E$308)-ROW($E$19)+1)/($E$19:$E$308<>\"\"),\n         ROW()-ROW($A$19)+1\n      )\n   ),\n\"\"))","v":""},{"$f":"IF($F$19<>\"\",\n$F$19,\nIFERROR(\n   INDEX($H$19:$H$80,\n      _xlfn.AGGREGATE(15,6,\n         (ROW($H$19:$H$80)-ROW($H$19)+1)/($H$19:$H$80<>\"\"),\n         ROW()-ROW($B$19)+1\n      )\n   ),\n\"\"))","v":""},{"$f":"IF($F$18<>\"\",\n\"\",\nIF(ROW()-ROW($C$19)+1<=ROWS('Ações gerais'!$A$4:$A$203),\n   INDEX('Ações gerais'!$A$4:$A$203, ROW()-ROW($C$19)+1),\n   INDEX(Operacionalização!$A$4:$A$93, ROW()-ROW($C$19)+1 - ROWS('Ações gerais'!$A$4:$A$203))\n))","v":0},null,{"$f":"IF($F$18<>\"\",\n\"\",\nIF(OR($C62=\"\",$C62=0),\n   \"\",\n   IF(COUNTIF($C$19:C62,C62)=1,C62,\"\")\n))","v":""},null,{"$f":"IF($F$19<>\"\",\n\"\",\nIF('Ações Cultura Viva'!B47=\"\",\n   \"\",\n   'Ações Cultura Viva'!B47\n))","v":""},{"$f":"IF($F$19<>\"\",\n\"\",\nIF(G62=\"\",\n   \"\",\n   IF(COUNTIF($G$19:G62,G62)=1,G62,\"\")\n))","v":""}]
[{"$f":"IF($F$18<>\"\",\n$F$18,\nIFERROR(\n   INDEX($E$19:$E$308,\n      _xlfn.AGGREGATE(15,6,\n         (ROW($E$19:$E$308)-ROW($E$19)+1)/($E$19:$E$308<>\"\"),\n         ROW()-ROW($A$19)+1\n      )\n   ),\n\"\"))","v":""},{"$f":"IF($F$19<>\"\",\n$F$19,\nIFERROR(\n   INDEX($H$19:$H$80,\n      _xlfn.AGGREGATE(15,6,\n         (ROW($H$19:$H$80)-ROW($H$19)+1)/($H$19:$H$80<>\"\"),\n         ROW()-ROW($B$19)+1\n      )\n   ),\n\"\"))","v":""},{"$f":"IF($F$18<>\"\",\n\"\",\nIF(ROW()-ROW($C$19)+1<=ROWS('Ações gerais'!$A$4:$A$203),\n   INDEX('Ações gerais'!$A$4:$A$203, ROW()-ROW($C$19)+1),\n   INDEX(Operacionalização!$A$4:$A$93, ROW()-ROW($C$19)+1 - ROWS('Ações gerais'!$A$4:$A$203))\n))","v":0},null,{"$f":"IF($F$18<>\"\",\n\"\",\nIF(OR($C63=\"\",$C63=0),\n   \"\",\n   IF(COUNTIF($C$19:C63,C63)=1,C63,\"\")\n))","v":""},null,{"$f":"IF($F$19<>\"\",\n\"\",\nIF('Ações Cultura Viva'!B48=\"\",\n   \"\",\n   'Ações Cultura Viva'!B48\n))","v":""},{"$f":"IF($F$19<>\"\",\n\"\",\nIF(G63=\"\",\n   \"\",\n   IF(COUNTIF($G$19:G63,G63)=1,G63,\"\")\n))","v":""}]
[{"$f":"IF($F$18<>\"\",\n$F$18,\nIFERROR(\n   INDEX($E$19:$E$308,\n      _xlfn.AGGREGATE(15,6,\n         (ROW($E$19:$E$308)-ROW($E$19)+1)/($E$19:$E$308<>\"\"),\n         ROW()-ROW($A$19)+1\n      )\n   ),\n\"\"))","v":""},{"$f":"IF($F$19<>\"\",\n$F$19,\nIFERROR(\n   INDEX($H$19:$H$80,\n      _xlfn.AGGREGATE(15,6,\n         (ROW($H$19:$H$80)-ROW($H$19)+1)/($H$19:$H$80<>\"\"),\n         ROW()-ROW($B$19)+1\n      )\n   ),\n\"\"))","v":""},{"$f":"IF($F$18<>\"\",\n\"\",\nIF(ROW()-ROW($C$19)+1<=ROWS('Ações gerais'!$A$4:$A$203),\n   INDEX('Ações gerais'!$A$4:$A$203, ROW()-ROW($C$19)+1),\n   INDEX(Operacionalização!$A$4:$A$93, ROW()-ROW($C$19)+1 - ROWS('Ações gerais'!$A$4:$A$203))\n))","v":0},null,{"$f":"IF($F$18<>\"\",\n\"\",\nIF(OR($C64=\"\",$C64=0),\n   \"\",\n   IF(COUNTIF($C$19:C64,C64)=1,C64,\"\")\n))","v":""},null,{"$f":"IF($F$19<>\"\",\n\"\",\nIF('Ações Cultura Viva'!B49=\"\",\n   \"\",\n   'Ações Cultura Viva'!B49\n))","v":""},{"$f":"IF($F$19<>\"\",\n\"\",\nIF(G64=\"\",\n   \"\",\n   IF(COUNTIF($G$19:G64,G64)=1,G64,\"\")\n))","v":""}]
[{"$f":"IF($F$18<>\"\",\n$F$18,\nIFERROR(\n   INDEX($E$19:$E$308,\n      _xlfn.AGGREGATE(15,6,\n         (ROW($E$19:$E$308)-ROW($E$19)+1)/($E$19:$E$308<>\"\"),\n         ROW()-ROW($A$19)+1\n      )\n   ),\n\"\"))","v":""},{"$f":"IF($F$19<>\"\",\n$F$19,\nIFERROR(\n   INDEX($H$19:$H$80,\n      _xlfn.AGGREGATE(15,6,\n         (ROW($H$19:$H$80)-ROW($H$19)+1)/($H$19:$H$80<>\"\"),\n         ROW()-ROW($B$19)+1\n      )\n   ),\n\"\"))","v":""},{"$f":"IF($F$18<>\"\",\n\"\",\nIF(ROW()-ROW($C$19)+1<=ROWS('Ações gerais'!$A$4:$A$203),\n   INDEX('Ações gerais'!$A$4:$A$203, ROW()-ROW($C$19)+1),\n   INDEX(Operacionalização!$A$4:$A$93, ROW()-ROW($C$19)+1 - ROWS('Ações gerais'!$A$4:$A$203))\n))","v":0},null,{"$f":"IF($F$18<>\"\",\n\"\",\nIF(OR($C65=\"\",$C65=0),\n   \"\",\n   IF(COUNTIF($C$19:C65,C65)=1,C65,\"\")\n))","v":""},null,{"$f":"IF($F$19<>\"\",\n\"\",\nIF('Ações Cultura Viva'!B50=\"\",\n   \"\",\n   'Ações Cultura Viva'!B50\n))","v":""},{"$f":"IF($F$19<>\"\",\n\"\",\nIF(G65=\"\",\n   \"\",\n   IF(COUNTIF($G$19:G65,G65)=1,G65,\"\")\n))","v":""}]
[{"$f":"IF($F$18<>\"\",\n$F$18,\nIFERROR(\n   INDEX($E$19:$E$308,\n      _xlfn.AGGREGATE(15,6,\n         (ROW($E$19:$E$308)-ROW($E$19)+1)/($E$19:$E$308<>\"\"),\n         ROW()-ROW($A$19)+1\n      )\n   ),\n\"\"))","v":""},{"$f":"IF($F$19<>\"\",\n$F$19,\nIFERROR(\n   INDEX($H$19:$H$80,\n      _xlfn.AGGREGATE(15,6,\n         (ROW($H$19:$H$80)-ROW($H$19)+1)/($H$19:$H$80<>\"\"),\n         ROW()-ROW($B$19)+1\n      )\n   ),\n\"\"))","v":""},{"$f":"IF($F$18<>\"\",\n\"\",\nIF(ROW()-ROW($C$19)+1<=ROWS('Ações gerais'!$A$4:$A$203),\n   INDEX('Ações gerais'!$A$4:$A$203, ROW()-ROW($C$19)+1),\n   INDEX(Operacionalização!$A$4:$A$93, ROW()-ROW($C$19)+1 - ROWS('Ações gerais'!$A$4:$A$203))\n))","v":0},null,{"$f":"IF($F$18<>\"\",\n\"\",\nIF(OR($C66=\"\",$C66=0),\n   \"\",\n   IF(COUNTIF($C$19:C66,C66)=1,C66,\"\")\n))","v":""},null,{"$f":"IF($F$19<>\"\",\n\"\",\nIF('Ações Cultura Viva'!B51=\"\",\n   \"\",\n   'Ações Cultura Viva'!B51\n))","v":""},{"$f":"IF($F$19<>\"\",\n\"\",\nIF(G66=\"\",\n   \"\",\n   IF(COUNTIF($G$19:G66,G66)=1,G66,\"\")\n))","v":""}]
[{"$f":"IF($F$18<>\"\",\n$F$18,\nIFERROR(\n   INDEX($E$19:$E$308,\n      _xlfn.AGGREGATE(15,6,\n         (ROW($E$19:$E$308)-ROW($E$19)+1)/($E$19:$E$308<>\"\"),\n         ROW()-ROW($A$19)+1\n      )\n   ),\n\"\"))","v":""},{"$f":"IF($F$19<>\"\",\n$F$19,\nIFERROR(\n   INDEX($H$19:$H$80,\n      _xlfn.AGGREGATE(15,6,\n         (ROW($H$19:$H$80)-ROW($H$19)+1)/($H$19:$H$80<>\"\"),\n         ROW()-ROW($B$19)+1\n      )\n   ),\n\"\"))","v":""},{"$f":"IF($F$18<>\"\",\n\"\",\nIF(ROW()-ROW($C$19)+1<=ROWS('Ações gerais'!$A$4:$A$203),\n   INDEX('Ações gerais'!$A$4:$A$203, ROW()-ROW($C$19)+1),\n   INDEX(Operacionalização!$A$4:$A$93, ROW()-ROW($C$19)+1 - ROWS('Ações gerais'!$A$4:$A$203))\n))","v":0},null,{"$f":"IF($F$18<>\"\",\n\"\",\nIF(OR($C67=\"\",$C67=0),\n   \"\",\n   IF(COUNTIF($C$19:C67,C67)=1,C67,\"\")\n))","v":""},null,{"$f":"IF($F$19<>\"\",\n\"\",\nIF('Ações Cultura Viva'!B52=\"\",\n   \"\",\n   'Ações Cultura Viva'!B52\n))","v":""},{"$f":"IF($F$19<>\"\",\n\"\",\nIF(G67=\"\",\n   \"\",\n   IF(COUNTIF($G$19:G67,G67)=1,G67,\"\")\n))","v":""}]
[{"$f":"IF($F$18<>\"\",\n$F$18,\nIFERROR(\n   INDEX($E$19:$E$308,\n      _xlfn.AGGREGATE(15,6,\n         (ROW($E$19:$E$308)-ROW($E$19)+1)/($E$19:$E$308<>\"\"),\n         ROW()-ROW($A$19)+1\n      )\n   ),\n\"\"))","v":""},{"$f":"IF($F$19<>\"\",\n$F$19,\nIFERROR(\n   INDEX($H$19:$H$80,\n      _xlfn.AGGREGATE(15,6,\n         (ROW($H$19:$H$80)-ROW($H$19)+1)/($H$19:$H$80<>\"\"),\n         ROW()-ROW($B$19)+1\n      )\n   ),\n\"\"))","v":""},{"$f":"IF($F$18<>\"\",\n\"\",\nIF(ROW()-ROW($C$19)+1<=ROWS('Ações gerais'!$A$4:$A$203),\n   INDEX('Ações gerais'!$A$4:$A$203, ROW()-ROW($C$19)+1),\n   INDEX(Operacionalização!$A$4:$A$93, ROW()-ROW($C$19)+1 - ROWS('Ações gerais'!$A$4:$A$203))\n))","v":0},null,{"$f":"IF($F$18<>\"\",\n\"\",\nIF(OR($C68=\"\",$C68=0),\n   \"\",\n   IF(COUNTIF($C$19:C68,C68)=1,C68,\"\")\n))","v":""},null,{"$f":"IF($F$19<>\"\",\n\"\",\nIF('Ações Cultura Viva'!B53=\"\",\n   \"\",\n   'Ações Cultura Viva'!B53\n))","v":""},{"$f":"IF($F$19<>\"\",\n\"\",\nIF(G68=\"\",\n   \"\",\n   IF(COUNTIF($G$19:G68,G68)=1,G68,\"\")\n))","v":""}]
[{"$f":"IF($F$18<>\"\",\n$F$18,\nIFERROR(\n   INDEX($E$19:$E$308,\n      _xlfn.AGGREGATE(15,6,\n         (ROW($E$19:$E$308)-ROW($E$19)+1)/($E$19:$E$308<>\"\"),\n         ROW()-ROW($A$19)+1\n      )\n   ),\n\"\"))","v":""},{"$f":"IF($F$19<>\"\",\n$F$19,\nIFERROR(\n   INDEX($H$19:$H$80,\n      _xlfn.AGGREGATE(15,6,\n         (ROW($H$19:$H$80)-ROW($H$19)+1)/($H$19:$H$80<>\"\"),\n         ROW()-ROW($B$19)+1\n      )\n   ),\n\"\"))","v":""},{"$f":"IF($F$18<>\"\",\n\"\",\nIF(ROW()-ROW($C$19)+1<=ROWS('Ações gerais'!$A$4:$A$203),\n   INDEX('Ações gerais'!$A$4:$A$203, ROW()-ROW($C$19)+1),\n   INDEX(Operacionalização!$A$4:$A$93, ROW()-ROW($C$19)+1 - ROWS('Ações gerais'!$A$4:$A$203))\n))","v":0},null,{"$f":"IF($F$18<>\"\",\n\"\",\nIF(OR($C69=\"\",$C69=0),\n   \"\",\n   IF(COUNTIF($C$19:C69,C69)=1,C69,\"\")\n))","v":""},null,{"$f":"IF($F$19<>\"\",\n\"\",\nIF('Ações Cultura Viva'!B54=\"\",\n   \"\",\n   'Ações Cultura Viva'!B54\n))","v":""},{"$f":"IF($F$19<>\"\",\n\"\",\nIF(G69=\"\",\n   \"\",\n   IF(COUNTIF($G$19:G69,G69)=1,G69,\"\")\n))","v":""}]
[{"$f":"IF($F$18<>\"\",\n$F$18,\nIFERROR(\n   INDEX($E$19:$E$308,\n      _xlfn.AGGREGATE(15,6,\n         (ROW($E$19:$E$308)-ROW($E$19)+1)/($E$19:$E$308<>\"\"),\n         ROW()-ROW($A$19)+1\n      )\n   ),\n\"\"))","v":""},{"$f":"IF($F$19<>\"\",\n$F$19,\nIFERROR(\n   INDEX($H$19:$H$80,\n      _xlfn.AGGREGATE(15,6,\n         (ROW($H$19:$H$80)-ROW($H$19)+1)/($H$19:$H$80<>\"\"),\n         ROW()-ROW($B$19)+1\n      )\n   ),\n\"\"))","v":""},{"$f":"IF($F$18<>\"\",\n\"\",\nIF(ROW()-ROW($C$19)+1<=ROWS('Ações gerais'!$A$4:$A$203),\n   INDEX('Ações gerais'!$A$4:$A$203, ROW()-ROW($C$19)+1),\n   INDEX(Operacionalização!$A$4:$A$93, ROW()-ROW($C$19)+1 - ROWS('Ações gerais'!$A$4:$A$203))\n))","v":0},null,{"$f":"IF($F$18<>\"\",\n\"\",\nIF(OR($C70=\"\",$C70=0),\n   \"\",\n   IF(COUNTIF($C$19:C70,C70)=1,C70,\"\")\n))","v":""},null,{"$f":"IF($F$19<>\"\",\n\"\",\nIF('Ações Cultura Viva'!B55=\"\",\n   \"\",\n   'Ações Cultura Viva'!B55\n))","v":""},{"$f":"IF($F$19<>\"\",\n\"\",\nIF(G70=\"\",\n   \"\",\n   IF(COUNTIF($G$19:G70,G70)=1,G70,\"\")\n))","v":""}]
[{"$f":"IF($F$18<>\"\",\n$F$18,\nIFERROR(\n   INDEX($E$19:$E$308,\n      _xlfn.AGGREGATE(15,6,\n         (ROW($E$19:$E$308)-ROW($E$19)+1)/($E$19:$E$308<>\"\"),\n         ROW()-ROW($A$19)+1\n      )\n   ),\n\"\"))","v":""},{"$f":"IF($F$19<>\"\",\n$F$19,\nIFERROR(\n   INDEX($H$19:$H$80,\n      _xlfn.AGGREGATE(15,6,\n         (ROW($H$19:$H$80)-ROW($H$19)+1)/($H$19:$H$80<>\"\"),\n         ROW()-ROW($B$19)+1\n      )\n   ),\n\"\"))","v":""},{"$f":"IF($F$18<>\"\",\n\"\",\nIF(ROW()-ROW($C$19)+1<=ROWS('Ações gerais'!$A$4:$A$203),\n   INDEX('Ações gerais'!$A$4:$A$203, ROW()-ROW($C$19)+1),\n   INDEX(Operacionalização!$A$4:$A$93, ROW()-ROW($C$19)+1 - ROWS('Ações gerais'!$A$4:$A$203))\n))","v":0},null,{"$f":"IF($F$18<>\"\",\n\"\",\nIF(OR($C71=\"\",$C71=0),\n   \"\",\n   IF(COUNTIF($C$19:C71,C71)=1,C71,\"\")\n))","v":""},null,{"$f":"IF($F$19<>\"\",\n\"\",\nIF('Ações Cultura Viva'!B56=\"\",\n   \"\",\n   'Ações Cultura Viva'!B56\n))","v":""},{"$f":"IF($F$19<>\"\",\n\"\",\nIF(G71=\"\",\n   \"\",\n   IF(COUNTIF($G$19:G71,G71)=1,G71,\"\")\n))","v":""}]
[{"$f":"IF($F$18<>\"\",\n$F$18,\nIFERROR(\n   INDEX($E$19:$E$308,\n      _xlfn.AGGREGATE(15,6,\n         (ROW($E$19:$E$308)-ROW($E$19)+1)/($E$19:$E$308<>\"\"),\n         ROW()-ROW($A$19)+1\n      )\n   ),\n\"\"))","v":""},{"$f":"IF($F$19<>\"\",\n$F$19,\nIFERROR(\n   INDEX($H$19:$H$80,\n      _xlfn.AGGREGATE(15,6,\n         (ROW($H$19:$H$80)-ROW($H$19)+1)/($H$19:$H$80<>\"\"),\n         ROW()-ROW($B$19)+1\n      )\n   ),\n\"\"))","v":""},{"$f":"IF($F$18<>\"\",\n\"\",\nIF(ROW()-ROW($C$19)+1<=ROWS('Ações gerais'!$A$4:$A$203),\n   INDEX('Ações gerais'!$A$4:$A$203, ROW()-ROW($C$19)+1),\n   INDEX(Operacionalização!$A$4:$A$93, ROW()-ROW($C$19)+1 - ROWS('Ações gerais'!$A$4:$A$203))\n))","v":0},null,{"$f":"IF($F$18<>\"\",\n\"\",\nIF(OR($C72=\"\",$C72=0),\n   \"\",\n   IF(COUNTIF($C$19:C72,C72)=1,C72,\"\")\n))","v":""},null,{"$f":"IF($F$19<>\"\",\n\"\",\nIF('Ações Cultura Viva'!B57=\"\",\n   \"\",\n   'Ações Cultura Viva'!B57\n))","v":""},{"$f":"IF($F$19<>\"\",\n\"\",\nIF(G72=\"\",\n   \"\",\n   IF(COUNTIF($G$19:G72,G72)=1,G72,\"\")\n))","v":""}]
[{"$f":"IF($F$18<>\"\",\n$F$18,\nIFERROR(\n   INDEX($E$19:$E$308,\n      _xlfn.AGGREGATE(15,6,\n         (ROW($E$19:$E$308)-ROW($E$19)+1)/($E$19:$E$308<>\"\"),\n         ROW()-ROW($A$19)+1\n      )\n   ),\n\"\"))","v":""},{"$f":"IF($F$19<>\"\",\n$F$19,\nIFERROR(\n   INDEX($H$19:$H$80,\n      _xlfn.AGGREGATE(15,6,\n         (ROW($H$19:$H$80)-ROW($H$19)+1)/($H$19:$H$80<>\"\"),\n         ROW()-ROW($B$19)+1\n      )\n   ),\n\"\"))","v":""},{"$f":"IF($F$18<>\"\",\n\"\",\nIF(ROW()-ROW($C$19)+1<=ROWS('Ações gerais'!$A$4:$A$203),\n   INDEX('Ações gerais'!$A$4:$A$203, ROW()-ROW($C$19)+1),\n   INDEX(Operacionalização!$A$4:$A$93, ROW()-ROW($C$19)+1 - ROWS('Ações gerais'!$A$4:$A$203))\n))","v":0},null,{"$f":"IF($F$18<>\"\",\n\"\",\nIF(OR($C73=\"\",$C73=0),\n   \"\",\n   IF(COUNTIF($C$19:C73,C73)=1,C73,\"\")\n))","v":""},null,{"$f":"IF($F$19<>\"\",\n\"\",\nIF('Ações Cultura Viva'!B58=\"\",\n   \"\",\n   'Ações Cultura Viva'!B58\n))","v":""},{"$f":"IF($F$19<>\"\",\n\"\",\nIF(G73=\"\",\n   \"\",\n   IF(COUNTIF($G$19:G73,G73)=1,G73,\"\")\n))","v":""}]
[{"$f":"IF($F$18<>\"\",\n$F$18,\nIFERROR(\n   INDEX($E$19:$E$308,\n      _xlfn.AGGREGATE(15,6,\n         (ROW($E$19:$E$308)-ROW($E$19)+1)/($E$19:$E$308<>\"\"),\n         ROW()-ROW($A$19)+1\n      )\n   ),\n\"\"))","v":""},{"$f":"IF($F$19<>\"\",\n$F$19,\nIFERROR(\n   INDEX($H$19:$H$80,\n      _xlfn.AGGREGATE(15,6,\n         (ROW($H$19:$H$80)-ROW($H$19)+1)/($H$19:$H$80<>\"\"),\n         ROW()-ROW($B$19)+1\n      )\n   ),\n\"\"))","v":""},{"$f":"IF($F$18<>\"\",\n\"\",\nIF(ROW()-ROW($C$19)+1<=ROWS('Ações gerais'!$A$4:$A$203),\n   INDEX('Ações gerais'!$A$4:$A$203, ROW()-ROW($C$19)+1),\n   INDEX(Operacionalização!$A$4:$A$93, ROW()-ROW($C$19)+1 - ROWS('Ações gerais'!$A$4:$A$203))\n))","v":0},null,{"$f":"IF($F$18<>\"\",\n\"\",\nIF(OR($C74=\"\",$C74=0),\n   \"\",\n   IF(COUNTIF($C$19:C74,C74)=1,C74,\"\")\n))","v":""},null,{"$f":"IF($F$19<>\"\",\n\"\",\nIF('Ações Cultura Viva'!B59=\"\",\n   \"\",\n   'Ações Cultura Viva'!B59\n))","v":""},{"$f":"IF($F$19<>\"\",\n\"\",\nIF(G74=\"\",\n   \"\",\n   IF(COUNTIF($G$19:G74,G74)=1,G74,\"\")\n))","v":""}]
[{"$f":"IF($F$18<>\"\",\n$F$18,\nIFERROR(\n   INDEX($E$19:$E$308,\n      _xlfn.AGGREGATE(15,6,\n         (ROW($E$19:$E$308)-ROW($E$19)+1)/($E$19:$E$308<>\"\"),\n         ROW()-ROW($A$19)+1\n      )\n   ),\n\"\"))","v":""},{"$f":"IF($F$19<>\"\",\n$F$19,\nIFERROR(\n   INDEX($H$19:$H$80,\n      _xlfn.AGGREGATE(15,6,\n         (ROW($H$19:$H$80)-ROW($H$19)+1)/($H$19:$H$80<>\"\"),\n         ROW()-ROW($B$19)+1\n      )\n   ),\n\"\"))","v":""},{"$f":"IF($F$18<>\"\",\n\"\",\nIF(ROW()-ROW($C$19)+1<=ROWS('Ações gerais'!$A$4:$A$203),\n   INDEX('Ações gerais'!$A$4:$A$203, ROW()-ROW($C$19)+1),\n   INDEX(Operacionalização!$A$4:$A$93, ROW()-ROW($C$19)+1 - ROWS('Ações gerais'!$A$4:$A$203))\n))","v":0},null,{"$f":"IF($F$18<>\"\",\n\"\",\nIF(OR($C75=\"\",$C75=0),\n   \"\",\n   IF(COUNTIF($C$19:C75,C75)=1,C75,\"\")\n))","v":""},null,{"$f":"IF($F$19<>\"\",\n\"\",\nIF('Ações Cultura Viva'!B60=\"\",\n   \"\",\n   'Ações Cultura Viva'!B60\n))","v":""},{"$f":"IF($F$19<>\"\",\n\"\",\nIF(G75=\"\",\n   \"\",\n   IF(COUNTIF($G$19:G75,G75)=1,G75,\"\")\n))","v":""}]
[{"$f":"IF($F$18<>\"\",\n$F$18,\nIFERROR(\n   INDEX($E$19:$E$308,\n      _xlfn.AGGREGATE(15,6,\n         (ROW($E$19:$E$308)-ROW($E$19)+1)/($E$19:$E$308<>\"\"),\n         ROW()-ROW($A$19)+1\n      )\n   ),\n\"\"))","v":""},{"$f":"IF($F$19<>\"\",\n$F$19,\nIFERROR(\n   INDEX($H$19:$H$80,\n      _xlfn.AGGREGATE(15,6,\n         (ROW($H$19:$H$80)-ROW($H$19)+1)/($H$19:$H$80<>\"\"),\n         ROW()-ROW($B$19)+1\n      )\n   ),\n\"\"))","v":""},{"$f":"IF($F$18<>\"\",\n\"\",\nIF(ROW()-ROW($C$19)+1<=ROWS('Ações gerais'!$A$4:$A$203),\n   INDEX('Ações gerais'!$A$4:$A$203, ROW()-ROW($C$19)+1),\n   INDEX(Operacionalização!$A$4:$A$93, ROW()-ROW($C$19)+1 - ROWS('Ações gerais'!$A$4:$A$203))\n))","v":0},null,{"$f":"IF($F$18<>\"\",\n\"\",\nIF(OR($C76=\"\",$C76=0),\n   \"\",\n   IF(COUNTIF($C$19:C76,C76)=1,C76,\"\")\n))","v":""},null,{"$f":"IF($F$19<>\"\",\n\"\",\nIF('Ações Cultura Viva'!B61=\"\",\n   \"\",\n   'Ações Cultura Viva'!B61\n))","v":""},{"$f":"IF($F$19<>\"\",\n\"\",\nIF(G76=\"\",\n   \"\",\n   IF(COUNTIF($G$19:G76,G76)=1,G76,\"\")\n))","v":""}]
[{"$f":"IF($F$18<>\"\",\n$F$18,\nIFERROR(\n   INDEX($E$19:$E$308,\n      _xlfn.AGGREGATE(15,6,\n         (ROW($E$19:$E$308)-ROW($E$19)+1)/($E$19:$E$308<>\"\"),\n         ROW()-ROW($A$19)+1\n      )\n   ),\n\"\"))","v":""},{"$f":"IF($F$19<>\"\",\n$F$19,\nIFERROR(\n   INDEX($H$19:$H$80,\n      _xlfn.AGGREGATE(15,6,\n         (ROW($H$19:$H$80)-ROW($H$19)+1)/($H$19:$H$80<>\"\"),\n         ROW()-ROW($B$19)+1\n      )\n   ),\n\"\"))","v":""},{"$f":"IF($F$18<>\"\",\n\"\",\nIF(ROW()-ROW($C$19)+1<=ROWS('Ações gerais'!$A$4:$A$203),\n   INDEX('Ações gerais'!$A$4:$A$203, ROW()-ROW($C$19)+1),\n   INDEX(Operacionalização!$A$4:$A$93, ROW()-ROW($C$19)+1 - ROWS('Ações gerais'!$A$4:$A$203))\n))","v":0},null,{"$f":"IF($F$18<>\"\",\n\"\",\nIF(OR($C77=\"\",$C77=0),\n   \"\",\n   IF(COUNTIF($C$19:C77,C77)=1,C77,\"\")\n))","v":""},null,{"$f":"IF($F$19<>\"\",\n\"\",\nIF('Ações Cultura Viva'!B62=\"\",\n   \"\",\n   'Ações Cultura Viva'!B62\n))","v":""},{"$f":"IF($F$19<>\"\",\n\"\",\nIF(G77=\"\",\n   \"\",\n   IF(COUNTIF($G$19:G77,G77)=1,G77,\"\")\n))","v":""}]
[{"$f":"IF($F$18<>\"\",\n$F$18,\nIFERROR(\n   INDEX($E$19:$E$308,\n      _xlfn.AGGREGATE(15,6,\n         (ROW($E$19:$E$308)-ROW($E$19)+1)/($E$19:$E$308<>\"\"),\n         ROW()-ROW($A$19)+1\n      )\n   ),\n\"\"))","v":""},{"$f":"IF($F$19<>\"\",\n$F$19,\nIFERROR(\n   INDEX($H$19:$H$80,\n      _xlfn.AGGREGATE(15,6,\n         (ROW($H$19:$H$80)-ROW($H$19)+1)/($H$19:$H$80<>\"\"),\n         ROW()-ROW($B$19)+1\n      )\n   ),\n\"\"))","v":""},{"$f":"IF($F$18<>\"\",\n\"\",\nIF(ROW()-ROW($C$19)+1<=ROWS('Ações gerais'!$A$4:$A$203),\n   INDEX('Ações gerais'!$A$4:$A$203, ROW()-ROW($C$19)+1),\n   INDEX(Operacionalização!$A$4:$A$93, ROW()-ROW($C$19)+1 - ROWS('Ações gerais'!$A$4:$A$203))\n))","v":0},null,{"$f":"IF($F$18<>\"\",\n\"\",\nIF(OR($C78=\"\",$C78=0),\n   \"\",\n   IF(COUNTIF($C$19:C78,C78)=1,C78,\"\")\n))","v":""},null,{"$f":"IF($F$19<>\"\",\n\"\",\nIF('Ações Cultura Viva'!B63=\"\",\n   \"\",\n   'Ações Cultura Viva'!B63\n))","v":""},{"$f":"IF($F$19<>\"\",\n\"\",\nIF(G78=\"\",\n   \"\",\n   IF(COUNTIF($G$19:G78,G78)=1,G78,\"\")\n))","v":""}]
[{"$f":"IF($F$18<>\"\",\n$F$18,\nIFERROR(\n   INDEX($E$19:$E$308,\n      _xlfn.AGGREGATE(15,6,\n         (ROW($E$19:$E$308)-ROW($E$19)+1)/($E$19:$E$308<>\"\"),\n         ROW()-ROW($A$19)+1\n      )\n   ),\n\"\"))","v":""},{"$f":"IF($F$19<>\"\",\n$F$19,\nIFERROR(\n   INDEX($H$19:$H$80,\n      _xlfn.AGGREGATE(15,6,\n         (ROW($H$19:$H$80)-ROW($H$19)+1)/($H$19:$H$80<>\"\"),\n         ROW()-ROW($B$19)+1\n      )\n   ),\n\"\"))","v":""},{"$f":"IF($F$18<>\"\",\n\"\",\nIF(ROW()-ROW($C$19)+1<=ROWS('Ações gerais'!$A$4:$A$203),\n   INDEX('Ações gerais'!$A$4:$A$203, ROW()-ROW($C$19)+1),\n   INDEX(Operacionalização!$A$4:$A$93, ROW()-ROW($C$19)+1 - ROWS('Ações gerais'!$A$4:$A$203))\n))","v":0},null,{"$f":"IF($F$18<>\"\",\n\"\",\nIF(OR($C79=\"\",$C79=0),\n   \"\",\n   IF(COUNTIF($C$19:C79,C79)=1,C79,\"\")\n))","v":""},null,{"$f":"IF($F$19<>\"\",\n\"\",\nIF('Ações Cultura Viva'!B64=\"\",\n   \"\",\n   'Ações Cultura Viva'!B64\n))","v":""},{"$f":"IF($F$19<>\"\",\n\"\",\nIF(G79=\"\",\n   \"\",\n   IF(COUNTIF($G$19:G79,G79)=1,G79,\"\")\n))","v":""}]
[{"$f":"IF($F$18<>\"\",\n$F$18,\nIFERROR(\n   INDEX($E$19:$E$308,\n      _xlfn.AGGREGATE(15,6,\n         (ROW($E$19:$E$308)-ROW($E$19)+1)/($E$19:$E$308<>\"\"),\n         ROW()-ROW($A$19)+1\n      )\n   ),\n\"\"))","v":""},{"$f":"IF($F$19<>\"\",\n$F$19,\nIFERROR(\n   INDEX($H$19:$H$80,\n      _xlfn.AGGREGATE(15,6,\n         (ROW($H$19:$H$80)-ROW($H$19)+1)/($H$19:$H$80<>\"\"),\n         ROW()-ROW($B$19)+1\n      )\n   ),\n\"\"))","v":""},{"$f":"IF($F$18<>\"\",\n\"\",\nIF(ROW()-ROW($C$19)+1<=ROWS('Ações gerais'!$A$4:$A$203),\n   INDEX('Ações gerais'!$A$4:$A$203, ROW()-ROW($C$19)+1),\n   INDEX(Operacionalização!$A$4:$A$93, ROW()-ROW($C$19)+1 - ROWS('Ações gerais'!$A$4:$A$203))\n))","v":0},null,{"$f":"IF($F$18<>\"\",\n\"\",\nIF(OR($C80=\"\",$C80=0),\n   \"\",\n   IF(COUNTIF($C$19:C80,C80)=1,C80,\"\")\n))","v":""},null,{"$f":"IF($F$19<>\"\",\n\"\",\nIF('Ações Cultura Viva'!B65=\"\",\n   \"\",\n   'Ações Cultura Viva'!B65\n))","v":""},{"$f":"IF($F$19<>\"\",\n\"\",\nIF(G80=\"\",\n   \"\",\n   IF(COUNTIF($G$19:G80,G80)=1,G80,\"\")\n))","v":""}]
[{"$f":"IF($F$18<>\"\",\n$F$18,\nIFERROR(\n   INDEX($E$19:$E$308,\n      _xlfn.AGGREGATE(15,6,\n         (ROW($E$19:$E$308)-ROW($E$19)+1)/($E$19:$E$308<>\"\"),\n         ROW()-ROW($A$19)+1\n      )\n   ),\n\"\"))","v":""},null,{"$f":"IF($F$18<>\"\",\n\"\",\nIF(ROW()-ROW($C$19)+1<=ROWS('Ações gerais'!$A$4:$A$203),\n   INDEX('Ações gerais'!$A$4:$A$203, ROW()-ROW($C$19)+1),\n   INDEX(Operacionalização!$A$4:$A$93, ROW()-ROW($C$19)+1 - ROWS('Ações gerais'!$A$4:$A$203))\n))","v":0},null,{"$f":"IF($F$18<>\"\",\n\"\",\nIF(OR($C81=\"\",$C81=0),\n   \"\",\n   IF(COUNTIF($C$19:C81,C81)=1,C81,\"\")\n))","v":""}]
[{"$f":"IF($F$18<>\"\",\n$F$18,\nIFERROR(\n   INDEX($E$19:$E$308,\n      _xlfn.AGGREGATE(15,6,\n         (ROW($E$19:$E$308)-ROW($E$19)+1)/($E$19:$E$308<>\"\"),\n         ROW()-ROW($A$19)+1\n      )\n   ),\n\"\"))","v":""},null,{"$f":"IF($F$18<>\"\",\n\"\",\nIF(ROW()-ROW($C$19)+1<=ROWS('Ações gerais'!$A$4:$A$203),\n   INDEX('Ações gerais'!$A$4:$A$203, ROW()-ROW($C$19)+1),\n   INDEX(Operacionalização!$A$4:$A$93, ROW()-ROW($C$19)+1 - ROWS('Ações gerais'!$A$4:$A$203))\n))","v":0},null,{"$f":"IF($F$18<>\"\",\n\"\",\nIF(OR($C82=\"\",$C82=0),\n   \"\",\n   IF(COUNTIF($C$19:C82,C82)=1,C82,\"\")\n))","v":""}]
[{"$f":"IF($F$18<>\"\",\n$F$18,\nIFERROR(\n   INDEX($E$19:$E$308,\n      _xlfn.AGGREGATE(15,6,\n         (ROW($E$19:$E$308)-ROW($E$19)+1)/($E$19:$E$308<>\"\"),\n         ROW()-ROW($A$19)+1\n      )\n   ),\n\"\"))","v":""},null,{"$f":"IF($F$18<>\"\",\n\"\",\nIF(ROW()-ROW($C$19)+1<=ROWS('Ações gerais'!$A$4:$A$203),\n   INDEX('Ações gerais'!$A$4:$A$203, ROW()-ROW($C$19)+1),\n   INDEX(Operacionalização!$A$4:$A$93, ROW()-ROW($C$19)+1 - ROWS('Ações gerais'!$A$4:$A$203))\n))","v":0},null,{"$f":"IF($F$18<>\"\",\n\"\",\nIF(OR($C83=\"\",$C83=0),\n   \"\",\n   IF(COUNTIF($C$19:C83,C83)=1,C83,\"\")\n))","v":""}]
[{"$f":"IF($F$18<>\"\",\n$F$18,\nIFERROR(\n   INDEX($E$19:$E$308,\n      _xlfn.AGGREGATE(15,6,\n         (ROW($E$19:$E$308)-ROW($E$19)+1)/($E$19:$E$308<>\"\"),\n         ROW()-ROW($A$19)+1\n      )\n   ),\n\"\"))","v":""},null,{"$f":"IF($F$18<>\"\",\n\"\",\nIF(ROW()-ROW($C$19)+1<=ROWS('Ações gerais'!$A$4:$A$203),\n   INDEX('Ações gerais'!$A$4:$A$203, ROW()-ROW($C$19)+1),\n   INDEX(Operacionalização!$A$4:$A$93, ROW()-ROW($C$19)+1 - ROWS('Ações gerais'!$A$4:$A$203))\n))","v":0},null,{"$f":"IF($F$18<>\"\",\n\"\",\nIF(OR($C84=\"\",$C84=0),\n   \"\",\n   IF(COUNTIF($C$19:C84,C84)=1,C84,\"\")\n))","v":""}]
[{"$f":"IF($F$18<>\"\",\n$F$18,\nIFERROR(\n   INDEX($E$19:$E$308,\n      _xlfn.AGGREGATE(15,6,\n         (ROW($E$19:$E$308)-ROW($E$19)+1)/($E$19:$E$308<>\"\"),\n         ROW()-ROW($A$19)+1\n      )\n   ),\n\"\"))","v":""},null,{"$f":"IF($F$18<>\"\",\n\"\",\nIF(ROW()-ROW($C$19)+1<=ROWS('Ações gerais'!$A$4:$A$203),\n   INDEX('Ações gerais'!$A$4:$A$203, ROW()-ROW($C$19)+1),\n   INDEX(Operacionalização!$A$4:$A$93, ROW()-ROW($C$19)+1 - ROWS('Ações gerais'!$A$4:$A$203))\n))","v":0},null,{"$f":"IF($F$18<>\"\",\n\"\",\nIF(OR($C85=\"\",$C85=0),\n   \"\",\n   IF(COUNTIF($C$19:C85,C85)=1,C85,\"\")\n))","v":""}]
[{"$f":"IF($F$18<>\"\",\n$F$18,\nIFERROR(\n   INDEX($E$19:$E$308,\n      _xlfn.AGGREGATE(15,6,\n         (ROW($E$19:$E$308)-ROW($E$19)+1)/($E$19:$E$308<>\"\"),\n         ROW()-ROW($A$19)+1\n      )\n   ),\n\"\"))","v":""},null,{"$f":"IF($F$18<>\"\",\n\"\",\nIF(ROW()-ROW($C$19)+1<=ROWS('Ações gerais'!$A$4:$A$203),\n   INDEX('Ações gerais'!$A$4:$A$203, ROW()-ROW($C$19)+1),\n   INDEX(Operacionalização!$A$4:$A$93, ROW()-ROW($C$19)+1 - ROWS('Ações gerais'!$A$4:$A$203))\n))","v":0},null,{"$f":"IF($F$18<>\"\",\n\"\",\nIF(OR($C86=\"\",$C86=0),\n   \"\",\n   IF(COUNTIF($C$19:C86,C86)=1,C86,\"\")\n))","v":""}]
[{"$f":"IF($F$18<>\"\",\n$F$18,\nIFERROR(\n   INDEX($E$19:$E$308,\n      _xlfn.AGGREGATE(15,6,\n         (ROW($E$19:$E$308)-ROW($E$19)+1)/($E$19:$E$308<>\"\"),\n         ROW()-ROW($A$19)+1\n      )\n   ),\n\"\"))","v":""},null,{"$f":"IF($F$18<>\"\",\n\"\",\nIF(ROW()-ROW($C$19)+1<=ROWS('Ações gerais'!$A$4:$A$203),\n   INDEX('Ações gerais'!$A$4:$A$203, ROW()-ROW($C$19)+1),\n   INDEX(Operacionalização!$A$4:$A$93, ROW()-ROW($C$19)+1 - ROWS('Ações gerais'!$A$4:$A$203))\n))","v":0},null,{"$f":"IF($F$18<>\"\",\n\"\",\nIF(OR($C87=\"\",$C87=0),\n   \"\",\n   IF(COUNTIF($C$19:C87,C87)=1,C87,\"\")\n))","v":""}]
[{"$f":"IF($F$18<>\"\",\n$F$18,\nIFERROR(\n   INDEX($E$19:$E$308,\n      _xlfn.AGGREGATE(15,6,\n         (ROW($E$19:$E$308)-ROW($E$19)+1)/($E$19:$E$308<>\"\"),\n         ROW()-ROW($A$19)+1\n      )\n   ),\n\"\"))","v":""},null,{"$f":"IF($F$18<>\"\",\n\"\",\nIF(ROW()-ROW($C$19)+1<=ROWS('Ações gerais'!$A$4:$A$203),\n   INDEX('Ações gerais'!$A$4:$A$203, ROW()-ROW($C$19)+1),\n   INDEX(Operacionalização!$A$4:$A$93, ROW()-ROW($C$19)+1 - ROWS('Ações gerais'!$A$4:$A$203))\n))","v":0},null,{"$f":"IF($F$18<>\"\",\n\"\",\nIF(OR($C88=\"\",$C88=0),\n   \"\",\n   IF(COUNTIF($C$19:C88,C88)=1,C88,\"\")\n))","v":""}]
[{"$f":"IF($F$18<>\"\",\n$F$18,\nIFERROR(\n   INDEX($E$19:$E$308,\n      _xlfn.AGGREGATE(15,6,\n         (ROW($E$19:$E$308)-ROW($E$19)+1)/($E$19:$E$308<>\"\"),\n         ROW()-ROW($A$19)+1\n      )\n   ),\n\"\"))","v":""},null,{"$f":"IF($F$18<>\"\",\n\"\",\nIF(ROW()-ROW($C$19)+1<=ROWS('Ações gerais'!$A$4:$A$203),\n   INDEX('Ações gerais'!$A$4:$A$203, ROW()-ROW($C$19)+1),\n   INDEX(Operacionalização!$A$4:$A$93, ROW()-ROW($C$19)+1 - ROWS('Ações gerais'!$A$4:$A$203))\n))","v":0},null,{"$f":"IF($F$18<>\"\",\n\"\",\nIF(OR($C89=\"\",$C89=0),\n   \"\",\n   IF(COUNTIF($C$19:C89,C89)=1,C89,\"\")\n))","v":""}]
[{"$f":"IF($F$18<>\"\",\n$F$18,\nIFERROR(\n   INDEX($E$19:$E$308,\n      _xlfn.AGGREGATE(15,6,\n         (ROW($E$19:$E$308)-ROW($E$19)+1)/($E$19:$E$308<>\"\"),\n         ROW()-ROW($A$19)+1\n      )\n   ),\n\"\"))","v":""},null,{"$f":"IF($F$18<>\"\",\n\"\",\nIF(ROW()-ROW($C$19)+1<=ROWS('Ações gerais'!$A$4:$A$203),\n   INDEX('Ações gerais'!$A$4:$A$203, ROW()-ROW($C$19)+1),\n   INDEX(Operacionalização!$A$4:$A$93, ROW()-ROW($C$19)+1 - ROWS('Ações gerais'!$A$4:$A$203))\n))","v":0},null,{"$f":"IF($F$18<>\"\",\n\"\",\nIF(OR($C90=\"\",$C90=0),\n   \"\",\n   IF(COUNTIF($C$19:C90,C90)=1,C90,\"\")\n))","v":""}]
[{"$f":"IF($F$18<>\"\",\n$F$18,\nIFERROR(\n   INDEX($E$19:$E$308,\n      _xlfn.AGGREGATE(15,6,\n         (ROW($E$19:$E$308)-ROW($E$19)+1)/($E$19:$E$308<>\"\"),\n         ROW()-ROW($A$19)+1\n      )\n   ),\n\"\"))","v":""},null,{"$f":"IF($F$18<>\"\",\n\"\",\nIF(ROW()-ROW($C$19)+1<=ROWS('Ações gerais'!$A$4:$A$203),\n   INDEX('Ações gerais'!$A$4:$A$203, ROW()-ROW($C$19)+1),\n   INDEX(Operacionalização!$A$4:$A$93, ROW()-ROW($C$19)+1 - ROWS('Ações gerais'!$A$4:$A$203))\n))","v":0},null,{"$f":"IF($F$18<>\"\",\n\"\",\nIF(OR($C91=\"\",$C91=0),\n   \"\",\n   IF(COUNTIF($C$19:C91,C91)=1,C91,\"\")\n))","v":""}]
[{"$f":"IF($F$18<>\"\",\n$F$18,\nIFERROR(\n   INDEX($E$19:$E$308,\n      _xlfn.AGGREGATE(15,6,\n         (ROW($E$19:$E$308)-ROW($E$19)+1)/($E$19:$E$308<>\"\"),\n         ROW()-ROW($A$19)+1\n      )\n   ),\n\"\"))","v":""},null,{"$f":"IF($F$18<>\"\",\n\"\",\nIF(ROW()-ROW($C$19)+1<=ROWS('Ações gerais'!$A$4:$A$203),\n   INDEX('Ações gerais'!$A$4:$A$203, ROW()-ROW($C$19)+1),\n   INDEX(Operacionalização!$A$4:$A$93, ROW()-ROW($C$19)+1 - ROWS('Ações gerais'!$A$4:$A$203))\n))","v":0},null,{"$f":"IF($F$18<>\"\",\n\"\",\nIF(OR($C92=\"\",$C92=0),\n   \"\",\n   IF(COUNTIF($C$19:C92,C92)=1,C92,\"\")\n))","v":""}]
[{"$f":"IF($F$18<>\"\",\n$F$18,\nIFERROR(\n   INDEX($E$19:$E$308,\n      _xlfn.AGGREGATE(15,6,\n         (ROW($E$19:$E$308)-ROW($E$19)+1)/($E$19:$E$308<>\"\"),\n         ROW()-ROW($A$19)+1\n      )\n   ),\n\"\"))","v":""},null,{"$f":"IF($F$18<>\"\",\n\"\",\nIF(ROW()-ROW($C$19)+1<=ROWS('Ações gerais'!$A$4:$A$203),\n   INDEX('Ações gerais'!$A$4:$A$203, ROW()-ROW($C$19)+1),\n   INDEX(Operacionalização!$A$4:$A$93, ROW()-ROW($C$19)+1 - ROWS('Ações gerais'!$A$4:$A$203))\n))","v":0},null,{"$f":"IF($F$18<>\"\",\n\"\",\nIF(OR($C93=\"\",$C93=0),\n   \"\",\n   IF(COUNTIF($C$19:C93,C93)=1,C93,\"\")\n))","v":""}]
[{"$f":"IF($F$18<>\"\",\n$F$18,\nIFERROR(\n   INDEX($E$19:$E$308,\n      _xlfn.AGGREGATE(15,6,\n         (ROW($E$19:$E$308)-ROW($E$19)+1)/($E$19:$E$308<>\"\"),\n         ROW()-ROW($A$19)+1\n      )\n   ),\n\"\"))","v":""},null,{"$f":"IF($F$18<>\"\",\n\"\",\nIF(ROW()-ROW($C$19)+1<=ROWS('Ações gerais'!$A$4:$A$203),\n   INDEX('Ações gerais'!$A$4:$A$203, ROW()-ROW($C$19)+1),\n   INDEX(Operacionalização!$A$4:$A$93, ROW()-ROW($C$19)+1 - ROWS('Ações gerais'!$A$4:$A$203))\n))","v":0},null,{"$f":"IF($F$18<>\"\",\n\"\",\nIF(OR($C94=\"\",$C94=0),\n   \"\",\n   IF(COUNTIF($C$19:C94,C94)=1,C94,\"\")\n))","v":""}]
[{"$f":"IF($F$18<>\"\",\n$F$18,\nIFERROR(\n   INDEX($E$19:$E$308,\n      _xlfn.AGGREGATE(15,6,\n         (ROW($E$19:$E$308)-ROW($E$19)+1)/($E$19:$E$308<>\"\"),\n         ROW()-ROW($A$19)+1\n      )\n   ),\n\"\"))","v":""},null,{"$f":"IF($F$18<>\"\",\n\"\",\nIF(ROW()-ROW($C$19)+1<=ROWS('Ações gerais'!$A$4:$A$203),\n   INDEX('Ações gerais'!$A$4:$A$203, ROW()-ROW($C$19)+1),\n   INDEX(Operacionalização!$A$4:$A$93, ROW()-ROW($C$19)+1 - ROWS('Ações gerais'!$A$4:$A$203))\n))","v":0},null,{"$f":"IF($F$18<>\"\",\n\"\",\nIF(OR($C95=\"\",$C95=0),\n   \"\",\n   IF(COUNTIF($C$19:C95,C95)=1,C95,\"\")\n))","v":""}]
[{"$f":"IF($F$18<>\"\",\n$F$18,\nIFERROR(\n   INDEX($E$19:$E$308,\n      _xlfn.AGGREGATE(15,6,\n         (ROW($E$19:$E$308)-ROW($E$19)+1)/($E$19:$E$308<>\"\"),\n         ROW()-ROW($A$19)+1\n      )\n   ),\n\"\"))","v":""},null,{"$f":"IF($F$18<>\"\",\n\"\",\nIF(ROW()-ROW($C$19)+1<=ROWS('Ações gerais'!$A$4:$A$203),\n   INDEX('Ações gerais'!$A$4:$A$203, ROW()-ROW($C$19)+1),\n   INDEX(Operacionalização!$A$4:$A$93, ROW()-ROW($C$19)+1 - ROWS('Ações gerais'!$A$4:$A$203))\n))","v":0},null,{"$f":"IF($F$18<>\"\",\n\"\",\nIF(OR($C96=\"\",$C96=0),\n   \"\",\n   IF(COUNTIF($C$19:C96,C96)=1,C96,\"\")\n))","v":""}]
[{"$f":"IF($F$18<>\"\",\n$F$18,\nIFERROR(\n   INDEX($E$19:$E$308,\n      _xlfn.AGGREGATE(15,6,\n         (ROW($E$19:$E$308)-ROW($E$19)+1)/($E$19:$E$308<>\"\"),\n         ROW()-ROW($A$19)+1\n      )\n   ),\n\"\"))","v":""},null,{"$f":"IF($F$18<>\"\",\n\"\",\nIF(ROW()-ROW($C$19)+1<=ROWS('Ações gerais'!$A$4:$A$203),\n   INDEX('Ações gerais'!$A$4:$A$203, ROW()-ROW($C$19)+1),\n   INDEX(Operacionalização!$A$4:$A$93, ROW()-ROW($C$19)+1 - ROWS('Ações gerais'!$A$4:$A$203))\n))","v":0},null,{"$f":"IF($F$18<>\"\",\n\"\",\nIF(OR($C97=\"\",$C97=0),\n   \"\",\n   IF(COUNTIF($C$19:C97,C97)=1,C97,\"\")\n))","v":""}]
[{"$f":"IF($F$18<>\"\",\n$F$18,\nIFERROR(\n   INDEX($E$19:$E$308,\n      _xlfn.AGGREGATE(15,6,\n         (ROW($E$19:$E$308)-ROW($E$19)+1)/($E$19:$E$308<>\"\"),\n         ROW()-ROW($A$19)+1\n      )\n   ),\n\"\"))","v":""},null,{"$f":"IF($F$18<>\"\",\n\"\",\nIF(ROW()-ROW($C$19)+1<=ROWS('Ações gerais'!$A$4:$A$203),\n   INDEX('Ações gerais'!$A$4:$A$203, ROW()-ROW($C$19)+1),\n   INDEX(Operacionalização!$A$4:$A$93, ROW()-ROW($C$19)+1 - ROWS('Ações gerais'!$A$4:$A$203))\n))","v":0},null,{"$f":"IF($F$18<>\"\",\n\"\",\nIF(OR($C98=\"\",$C98=0),\n   \"\",\n   IF(COUNTIF($C$19:C98,C98)=1,C98,\"\")\n))","v":""}]
[{"$f":"IF($F$18<>\"\",\n$F$18,\nIFERROR(\n   INDEX($E$19:$E$308,\n      _xlfn.AGGREGATE(15,6,\n         (ROW($E$19:$E$308)-ROW($E$19)+1)/($E$19:$E$308<>\"\"),\n         ROW()-ROW($A$19)+1\n      )\n   ),\n\"\"))","v":""},null,{"$f":"IF($F$18<>\"\",\n\"\",\nIF(ROW()-ROW($C$19)+1<=ROWS('Ações gerais'!$A$4:$A$203),\n   INDEX('Ações gerais'!$A$4:$A$203, ROW()-ROW($C$19)+1),\n   INDEX(Operacionalização!$A$4:$A$93, ROW()-ROW($C$19)+1 - ROWS('Ações gerais'!$A$4:$A$203))\n))","v":0},null,{"$f":"IF($F$18<>\"\",\n\"\",\nIF(OR($C99=\"\",$C99=0),\n   \"\",\n   IF(COUNTIF($C$19:C99,C99)=1,C99,\"\")\n))","v":""}]
[{"$f":"IF($F$18<>\"\",\n$F$18,\nIFERROR(\n   INDEX($E$19:$E$308,\n      _xlfn.AGGREGATE(15,6,\n         (ROW($E$19:$E$308)-ROW($E$19)+1)/($E$19:$E$308<>\"\"),\n         ROW()-ROW($A$19)+1\n      )\n   ),\n\"\"))","v":""},null,{"$f":"IF($F$18<>\"\",\n\"\",\nIF(ROW()-ROW($C$19)+1<=ROWS('Ações gerais'!$A$4:$A$203),\n   INDEX('Ações gerais'!$A$4:$A$203, ROW()-ROW($C$19)+1),\n   INDEX(Operacionalização!$A$4:$A$93, ROW()-ROW($C$19)+1 - ROWS('Ações gerais'!$A$4:$A$203))\n))","v":0},null,{"$f":"IF($F$18<>\"\",\n\"\",\nIF(OR($C100=\"\",$C100=0),\n   \"\",\n   IF(COUNTIF($C$19:C100,C100)=1,C100,\"\")\n))","v":""}]
[{"$f":"IF($F$18<>\"\",\n$F$18,\nIFERROR(\n   INDEX($E$19:$E$308,\n      _xlfn.AGGREGATE(15,6,\n         (ROW($E$19:$E$308)-ROW($E$19)+1)/($E$19:$E$308<>\"\"),\n         ROW()-ROW($A$19)+1\n      )\n   ),\n\"\"))","v":""},null,{"$f":"IF($F$18<>\"\",\n\"\",\nIF(ROW()-ROW($C$19)+1<=ROWS('Ações gerais'!$A$4:$A$203),\n   INDEX('Ações gerais'!$A$4:$A$203, ROW()-ROW($C$19)+1),\n   INDEX(Operacionalização!$A$4:$A$93, ROW()-ROW($C$19)+1 - ROWS('Ações gerais'!$A$4:$A$203))\n))","v":0},null,{"$f":"IF($F$18<>\"\",\n\"\",\nIF(OR($C101=\"\",$C101=0),\n   \"\",\n   IF(COUNTIF($C$19:C101,C101)=1,C101,\"\")\n))","v":""}]
[{"$f":"IF($F$18<>\"\",\n$F$18,\nIFERROR(\n   INDEX($E$19:$E$308,\n      _xlfn.AGGREGATE(15,6,\n         (ROW($E$19:$E$308)-ROW($E$19)+1)/($E$19:$E$308<>\"\"),\n         ROW()-ROW($A$19)+1\n      )\n   ),\n\"\"))","v":""},null,{"$f":"IF($F$18<>\"\",\n\"\",\nIF(ROW()-ROW($C$19)+1<=ROWS('Ações gerais'!$A$4:$A$203),\n   INDEX('Ações gerais'!$A$4:$A$203, ROW()-ROW($C$19)+1),\n   INDEX(Operacionalização!$A$4:$A$93, ROW()-ROW($C$19)+1 - ROWS('Ações gerais'!$A$4:$A$203))\n))","v":0},null,{"$f":"IF($F$18<>\"\",\n\"\",\nIF(OR($C102=\"\",$C102=0),\n   \"\",\n   IF(COUNTIF($C$19:C102,C102)=1,C102,\"\")\n))","v":""}]
[{"$f":"IF($F$18<>\"\",\n$F$18,\nIFERROR(\n   INDEX($E$19:$E$308,\n      _xlfn.AGGREGATE(15,6,\n         (ROW($E$19:$E$308)-ROW($E$19)+1)/($E$19:$E$308<>\"\"),\n         ROW()-ROW($A$19)+1\n      )\n   ),\n\"\"))","v":""},null,{"$f":"IF($F$18<>\"\",\n\"\",\nIF(ROW()-ROW($C$19)+1<=ROWS('Ações gerais'!$A$4:$A$203),\n   INDEX('Ações gerais'!$A$4:$A$203, ROW()-ROW($C$19)+1),\n   INDEX(Operacionalização!$A$4:$A$93, ROW()-ROW($C$19)+1 - ROWS('Ações gerais'!$A$4:$A$203))\n))","v":0},null,{"$f":"IF($F$18<>\"\",\n\"\",\nIF(OR($C103=\"\",$C103=0),\n   \"\",\n   IF(COUNTIF($C$19:C103,C103)=1,C103,\"\")\n))","v":""}]
[{"$f":"IF($F$18<>\"\",\n$F$18,\nIFERROR(\n   INDEX($E$19:$E$308,\n      _xlfn.AGGREGATE(15,6,\n         (ROW($E$19:$E$308)-ROW($E$19)+1)/($E$19:$E$308<>\"\"),\n         ROW()-ROW($A$19)+1\n      )\n   ),\n\"\"))","v":""},null,{"$f":"IF($F$18<>\"\",\n\"\",\nIF(ROW()-ROW($C$19)+1<=ROWS('Ações gerais'!$A$4:$A$203),\n   INDEX('Ações gerais'!$A$4:$A$203, ROW()-ROW($C$19)+1),\n   INDEX(Operacionalização!$A$4:$A$93, ROW()-ROW($C$19)+1 - ROWS('Ações gerais'!$A$4:$A$203))\n))","v":0},null,{"$f":"IF($F$18<>\"\",\n\"\",\nIF(OR($C104=\"\",$C104=0),\n   \"\",\n   IF(COUNTIF($C$19:C104,C104)=1,C104,\"\")\n))","v":""}]
[{"$f":"IF($F$18<>\"\",\n$F$18,\nIFERROR(\n   INDEX($E$19:$E$308,\n      _xlfn.AGGREGATE(15,6,\n         (ROW($E$19:$E$308)-ROW($E$19)+1)/($E$19:$E$308<>\"\"),\n         ROW()-ROW($A$19)+1\n      )\n   ),\n\"\"))","v":""},null,{"$f":"IF($F$18<>\"\",\n\"\",\nIF(ROW()-ROW($C$19)+1<=ROWS('Ações gerais'!$A$4:$A$203),\n   INDEX('Ações gerais'!$A$4:$A$203, ROW()-ROW($C$19)+1),\n   INDEX(Operacionalização!$A$4:$A$93, ROW()-ROW($C$19)+1 - ROWS('Ações gerais'!$A$4:$A$203))\n))","v":0},null,{"$f":"IF($F$18<>\"\",\n\"\",\nIF(OR($C105=\"\",$C105=0),\n   \"\",\n   IF(COUNTIF($C$19:C105,C105)=1,C105,\"\")\n))","v":""}]
[{"$f":"IF($F$18<>\"\",\n$F$18,\nIFERROR(\n   INDEX($E$19:$E$308,\n      _xlfn.AGGREGATE(15,6,\n         (ROW($E$19:$E$308)-ROW($E$19)+1)/($E$19:$E$308<>\"\"),\n         ROW()-ROW($A$19)+1\n      )\n   ),\n\"\"))","v":""},null,{"$f":"IF($F$18<>\"\",\n\"\",\nIF(ROW()-ROW($C$19)+1<=ROWS('Ações gerais'!$A$4:$A$203),\n   INDEX('Ações gerais'!$A$4:$A$203, ROW()-ROW($C$19)+1),\n   INDEX(Operacionalização!$A$4:$A$93, ROW()-ROW($C$19)+1 - ROWS('Ações gerais'!$A$4:$A$203))\n))","v":0},null,{"$f":"IF($F$18<>\"\",\n\"\",\nIF(OR($C106=\"\",$C106=0),\n   \"\",\n   IF(COUNTIF($C$19:C106,C106)=1,C106,\"\")\n))","v":""}]
[{"$f":"IF($F$18<>\"\",\n$F$18,\nIFERROR(\n   INDEX($E$19:$E$308,\n      _xlfn.AGGREGATE(15,6,\n         (ROW($E$19:$E$308)-ROW($E$19)+1)/($E$19:$E$308<>\"\"),\n         ROW()-ROW($A$19)+1\n      )\n   ),\n\"\"))","v":""},null,{"$f":"IF($F$18<>\"\",\n\"\",\nIF(ROW()-ROW($C$19)+1<=ROWS('Ações gerais'!$A$4:$A$203),\n   INDEX('Ações gerais'!$A$4:$A$203, ROW()-ROW($C$19)+1),\n   INDEX(Operacionalização!$A$4:$A$93, ROW()-ROW($C$19)+1 - ROWS('Ações gerais'!$A$4:$A$203))\n))","v":0},null,{"$f":"IF($F$18<>\"\",\n\"\",\nIF(OR($C107=\"\",$C107=0),\n   \"\",\n   IF(COUNTIF($C$19:C107,C107)=1,C107,\"\")\n))","v":""}]
[{"$f":"IF($F$18<>\"\",\n$F$18,\nIFERROR(\n   INDEX($E$19:$E$308,\n      _xlfn.AGGREGATE(15,6,\n         (ROW($E$19:$E$308)-ROW($E$19)+1)/($E$19:$E$308<>\"\"),\n         ROW()-ROW($A$19)+1\n      )\n   ),\n\"\"))","v":""},null,{"$f":"IF($F$18<>\"\",\n\"\",\nIF(ROW()-ROW($C$19)+1<=ROWS('Ações gerais'!$A$4:$A$203),\n   INDEX('Ações gerais'!$A$4:$A$203, ROW()-ROW($C$19)+1),\n   INDEX(Operacionalização!$A$4:$A$93, ROW()-ROW($C$19)+1 - ROWS('Ações gerais'!$A$4:$A$203))\n))","v":0},null,{"$f":"IF($F$18<>\"\",\n\"\",\nIF(OR($C108=\"\",$C108=0),\n   \"\",\n   IF(COUNTIF($C$19:C108,C108)=1,C108,\"\")\n))","v":""}]
[{"$f":"IF($F$18<>\"\",\n$F$18,\nIFERROR(\n   INDEX($E$19:$E$308,\n      _xlfn.AGGREGATE(15,6,\n         (ROW($E$19:$E$308)-ROW($E$19)+1)/($E$19:$E$308<>\"\"),\n         ROW()-ROW($A$19)+1\n      )\n   ),\n\"\"))","v":""},null,{"$f":"IF($F$18<>\"\",\n\"\",\nIF(ROW()-ROW($C$19)+1<=ROWS('Ações gerais'!$A$4:$A$203),\n   INDEX('Ações gerais'!$A$4:$A$203, ROW()-ROW($C$19)+1),\n   INDEX(Operacionalização!$A$4:$A$93, ROW()-ROW($C$19)+1 - ROWS('Ações gerais'!$A$4:$A$203))\n))","v":0},null,{"$f":"IF($F$18<>\"\",\n\"\",\nIF(OR($C109=\"\",$C109=0),\n   \"\",\n   IF(COUNTIF($C$19:C109,C109)=1,C109,\"\")\n))","v":""}]
[{"$f":"IF($F$18<>\"\",\n$F$18,\nIFERROR(\n   INDEX($E$19:$E$308,\n      _xlfn.AGGREGATE(15,6,\n         (ROW($E$19:$E$308)-ROW($E$19)+1)/($E$19:$E$308<>\"\"),\n         ROW()-ROW($A$19)+1\n      )\n   ),\n\"\"))","v":""},null,{"$f":"IF($F$18<>\"\",\n\"\",\nIF(ROW()-ROW($C$19)+1<=ROWS('Ações gerais'!$A$4:$A$203),\n   INDEX('Ações gerais'!$A$4:$A$203, ROW()-ROW($C$19)+1),\n   INDEX(Operacionalização!$A$4:$A$93, ROW()-ROW($C$19)+1 - ROWS('Ações gerais'!$A$4:$A$203))\n))","v":0},null,{"$f":"IF($F$18<>\"\",\n\"\",\nIF(OR($C110=\"\",$C110=0),\n   \"\",\n   IF(COUNTIF($C$19:C110,C110)=1,C110,\"\")\n))","v":""}]
[{"$f":"IF($F$18<>\"\",\n$F$18,\nIFERROR(\n   INDEX($E$19:$E$308,\n      _xlfn.AGGREGATE(15,6,\n         (ROW($E$19:$E$308)-ROW($E$19)+1)/($E$19:$E$308<>\"\"),\n         ROW()-ROW($A$19)+1\n      )\n   ),\n\"\"))","v":""},null,{"$f":"IF($F$18<>\"\",\n\"\",\nIF(ROW()-ROW($C$19)+1<=ROWS('Ações gerais'!$A$4:$A$203),\n   INDEX('Ações gerais'!$A$4:$A$203, ROW()-ROW($C$19)+1),\n   INDEX(Operacionalização!$A$4:$A$93, ROW()-ROW($C$19)+1 - ROWS('Ações gerais'!$A$4:$A$203))\n))","v":0},null,{"$f":"IF($F$18<>\"\",\n\"\",\nIF(OR($C111=\"\",$C111=0),\n   \"\",\n   IF(COUNTIF($C$19:C111,C111)=1,C111,\"\")\n))","v":""}]
[{"$f":"IF($F$18<>\"\",\n$F$18,\nIFERROR(\n   INDEX($E$19:$E$308,\n      _xlfn.AGGREGATE(15,6,\n         (ROW($E$19:$E$308)-ROW($E$19)+1)/($E$19:$E$308<>\"\"),\n         ROW()-ROW($A$19)+1\n      )\n   ),\n\"\"))","v":""},null,{"$f":"IF($F$18<>\"\",\n\"\",\nIF(ROW()-ROW($C$19)+1<=ROWS('Ações gerais'!$A$4:$A$203),\n   INDEX('Ações gerais'!$A$4:$A$203, ROW()-ROW($C$19)+1),\n   INDEX(Operacionalização!$A$4:$A$93, ROW()-ROW($C$19)+1 - ROWS('Ações gerais'!$A$4:$A$203))\n))","v":0},null,{"$f":"IF($F$18<>\"\",\n\"\",\nIF(OR($C112=\"\",$C112=0),\n   \"\",\n   IF(COUNTIF($C$19:C112,C112)=1,C112,\"\")\n))","v":""}]
[{"$f":"IF($F$18<>\"\",\n$F$18,\nIFERROR(\n   INDEX($E$19:$E$308,\n      _xlfn.AGGREGATE(15,6,\n         (ROW($E$19:$E$308)-ROW($E$19)+1)/($E$19:$E$308<>\"\"),\n         ROW()-ROW($A$19)+1\n      )\n   ),\n\"\"))","v":""},null,{"$f":"IF($F$18<>\"\",\n\"\",\nIF(ROW()-ROW($C$19)+1<=ROWS('Ações gerais'!$A$4:$A$203),\n   INDEX('Ações gerais'!$A$4:$A$203, ROW()-ROW($C$19)+1),\n   INDEX(Operacionalização!$A$4:$A$93, ROW()-ROW($C$19)+1 - ROWS('Ações gerais'!$A$4:$A$203))\n))","v":0},null,{"$f":"IF($F$18<>\"\",\n\"\",\nIF(OR($C113=\"\",$C113=0),\n   \"\",\n   IF(COUNTIF($C$19:C113,C113)=1,C113,\"\")\n))","v":""}]
[{"$f":"IF($F$18<>\"\",\n$F$18,\nIFERROR(\n   INDEX($E$19:$E$308,\n      _xlfn.AGGREGATE(15,6,\n         (ROW($E$19:$E$308)-ROW($E$19)+1)/($E$19:$E$308<>\"\"),\n         ROW()-ROW($A$19)+1\n      )\n   ),\n\"\"))","v":""},null,{"$f":"IF($F$18<>\"\",\n\"\",\nIF(ROW()-ROW($C$19)+1<=ROWS('Ações gerais'!$A$4:$A$203),\n   INDEX('Ações gerais'!$A$4:$A$203, ROW()-ROW($C$19)+1),\n   INDEX(Operacionalização!$A$4:$A$93, ROW()-ROW($C$19)+1 - ROWS('Ações gerais'!$A$4:$A$203))\n))","v":0},null,{"$f":"IF($F$18<>\"\",\n\"\",\nIF(OR($C114=\"\",$C114=0),\n   \"\",\n   IF(COUNTIF($C$19:C114,C114)=1,C114,\"\")\n))","v":""}]
[{"$f":"IF($F$18<>\"\",\n$F$18,\nIFERROR(\n   INDEX($E$19:$E$308,\n      _xlfn.AGGREGATE(15,6,\n         (ROW($E$19:$E$308)-ROW($E$19)+1)/($E$19:$E$308<>\"\"),\n         ROW()-ROW($A$19)+1\n      )\n   ),\n\"\"))","v":""},null,{"$f":"IF($F$18<>\"\",\n\"\",\nIF(ROW()-ROW($C$19)+1<=ROWS('Ações gerais'!$A$4:$A$203),\n   INDEX('Ações gerais'!$A$4:$A$203, ROW()-ROW($C$19)+1),\n   INDEX(Operacionalização!$A$4:$A$93, ROW()-ROW($C$19)+1 - ROWS('Ações gerais'!$A$4:$A$203))\n))","v":0},null,{"$f":"IF($F$18<>\"\",\n\"\",\nIF(OR($C115=\"\",$C115=0),\n   \"\",\n   IF(COUNTIF($C$19:C115,C115)=1,C115,\"\")\n))","v":""}]
[{"$f":"IF($F$18<>\"\",\n$F$18,\nIFERROR(\n   INDEX($E$19:$E$308,\n      _xlfn.AGGREGATE(15,6,\n         (ROW($E$19:$E$308)-ROW($E$19)+1)/($E$19:$E$308<>\"\"),\n         ROW()-ROW($A$19)+1\n      )\n   ),\n\"\"))","v":""},null,{"$f":"IF($F$18<>\"\",\n\"\",\nIF(ROW()-ROW($C$19)+1<=ROWS('Ações gerais'!$A$4:$A$203),\n   INDEX('Ações gerais'!$A$4:$A$203, ROW()-ROW($C$19)+1),\n   INDEX(Operacionalização!$A$4:$A$93, ROW()-ROW($C$19)+1 - ROWS('Ações gerais'!$A$4:$A$203))\n))","v":0},null,{"$f":"IF($F$18<>\"\",\n\"\",\nIF(OR($C116=\"\",$C116=0),\n   \"\",\n   IF(COUNTIF($C$19:C116,C116)=1,C116,\"\")\n))","v":""}]
[{"$f":"IF($F$18<>\"\",\n$F$18,\nIFERROR(\n   INDEX($E$19:$E$308,\n      _xlfn.AGGREGATE(15,6,\n         (ROW($E$19:$E$308)-ROW($E$19)+1)/($E$19:$E$308<>\"\"),\n         ROW()-ROW($A$19)+1\n      )\n   ),\n\"\"))","v":""},null,{"$f":"IF($F$18<>\"\",\n\"\",\nIF(ROW()-ROW($C$19)+1<=ROWS('Ações gerais'!$A$4:$A$203),\n   INDEX('Ações gerais'!$A$4:$A$203, ROW()-ROW($C$19)+1),\n   INDEX(Operacionalização!$A$4:$A$93, ROW()-ROW($C$19)+1 - ROWS('Ações gerais'!$A$4:$A$203))\n))","v":0},null,{"$f":"IF($F$18<>\"\",\n\"\",\nIF(OR($C117=\"\",$C117=0),\n   \"\",\n   IF(COUNTIF($C$19:C117,C117)=1,C117,\"\")\n))","v":""}]
[{"$f":"IF($F$18<>\"\",\n$F$18,\nIFERROR(\n   INDEX($E$19:$E$308,\n      _xlfn.AGGREGATE(15,6,\n         (ROW($E$19:$E$308)-ROW($E$19)+1)/($E$19:$E$308<>\"\"),\n         ROW()-ROW($A$19)+1\n      )\n   ),\n\"\"))","v":""},null,{"$f":"IF($F$18<>\"\",\n\"\",\nIF(ROW()-ROW($C$19)+1<=ROWS('Ações gerais'!$A$4:$A$203),\n   INDEX('Ações gerais'!$A$4:$A$203, ROW()-ROW($C$19)+1),\n   INDEX(Operacionalização!$A$4:$A$93, ROW()-ROW($C$19)+1 - ROWS('Ações gerais'!$A$4:$A$203))\n))","v":0},null,{"$f":"IF($F$18<>\"\",\n\"\",\nIF(OR($C118=\"\",$C118=0),\n   \"\",\n   IF(COUNTIF($C$19:C118,C118)=1,C118,\"\")\n))","v":""}]
[{"$f":"IF($F$18<>\"\",\n$F$18,\nIFERROR(\n   INDEX($E$19:$E$308,\n      _xlfn.AGGREGATE(15,6,\n         (ROW($E$19:$E$308)-ROW($E$19)+1)/($E$19:$E$308<>\"\"),\n         ROW()-ROW($A$19)+1\n      )\n   ),\n\"\"))","v":""},null,{"$f":"IF($F$18<>\"\",\n\"\",\nIF(ROW()-ROW($C$19)+1<=ROWS('Ações gerais'!$A$4:$A$203),\n   INDEX('Ações gerais'!$A$4:$A$203, ROW()-ROW($C$19)+1),\n   INDEX(Operacionalização!$A$4:$A$93, ROW()-ROW($C$19)+1 - ROWS('Ações gerais'!$A$4:$A$203))\n))","v":0},null,{"$f":"IF($F$18<>\"\",\n\"\",\nIF(OR($C119=\"\",$C119=0),\n   \"\",\n   IF(COUNTIF($C$19:C119,C119)=1,C119,\"\")\n))","v":""}]
[{"$f":"IF($F$18<>\"\",\n$F$18,\nIFERROR(\n   INDEX($E$19:$E$308,\n      _xlfn.AGGREGATE(15,6,\n         (ROW($E$19:$E$308)-ROW($E$19)+1)/($E$19:$E$308<>\"\"),\n         ROW()-ROW($A$19)+1\n      )\n   ),\n\"\"))","v":""},null,{"$f":"IF($F$18<>\"\",\n\"\",\nIF(ROW()-ROW($C$19)+1<=ROWS('Ações gerais'!$A$4:$A$203),\n   INDEX('Ações gerais'!$A$4:$A$203, ROW()-ROW($C$19)+1),\n   INDEX(Operacionalização!$A$4:$A$93, ROW()-ROW($C$19)+1 - ROWS('Ações gerais'!$A$4:$A$203))\n))","v":0},null,{"$f":"IF($F$18<>\"\",\n\"\",\nIF(OR($C120=\"\",$C120=0),\n   \"\",\n   IF(COUNTIF($C$19:C120,C120)=1,C120,\"\")\n))","v":""}]
[{"$f":"IF($F$18<>\"\",\n$F$18,\nIFERROR(\n   INDEX($E$19:$E$308,\n      _xlfn.AGGREGATE(15,6,\n         (ROW($E$19:$E$308)-ROW($E$19)+1)/($E$19:$E$308<>\"\"),\n         ROW()-ROW($A$19)+1\n      )\n   ),\n\"\"))","v":""},null,{"$f":"IF($F$18<>\"\",\n\"\",\nIF(ROW()-ROW($C$19)+1<=ROWS('Ações gerais'!$A$4:$A$203),\n   INDEX('Ações gerais'!$A$4:$A$203, ROW()-ROW($C$19)+1),\n   INDEX(Operacionalização!$A$4:$A$93, ROW()-ROW($C$19)+1 - ROWS('Ações gerais'!$A$4:$A$203))\n))","v":0},null,{"$f":"IF($F$18<>\"\",\n\"\",\nIF(OR($C121=\"\",$C121=0),\n   \"\",\n   IF(COUNTIF($C$19:C121,C121)=1,C121,\"\")\n))","v":""}]
[{"$f":"IF($F$18<>\"\",\n$F$18,\nIFERROR(\n   INDEX($E$19:$E$308,\n      _xlfn.AGGREGATE(15,6,\n         (ROW($E$19:$E$308)-ROW($E$19)+1)/($E$19:$E$308<>\"\"),\n         ROW()-ROW($A$19)+1\n      )\n   ),\n\"\"))","v":""},null,{"$f":"IF($F$18<>\"\",\n\"\",\nIF(ROW()-ROW($C$19)+1<=ROWS('Ações gerais'!$A$4:$A$203),\n   INDEX('Ações gerais'!$A$4:$A$203, ROW()-ROW($C$19)+1),\n   INDEX(Operacionalização!$A$4:$A$93, ROW()-ROW($C$19)+1 - ROWS('Ações gerais'!$A$4:$A$203))\n))","v":0},null,{"$f":"IF($F$18<>\"\",\n\"\",\nIF(OR($C122=\"\",$C122=0),\n   \"\",\n   IF(COUNTIF($C$19:C122,C122)=1,C122,\"\")\n))","v":""}]
[{"$f":"IF($F$18<>\"\",\n$F$18,\nIFERROR(\n   INDEX($E$19:$E$308,\n      _xlfn.AGGREGATE(15,6,\n         (ROW($E$19:$E$308)-ROW($E$19)+1)/($E$19:$E$308<>\"\"),\n         ROW()-ROW($A$19)+1\n      )\n   ),\n\"\"))","v":""},null,{"$f":"IF($F$18<>\"\",\n\"\",\nIF(ROW()-ROW($C$19)+1<=ROWS('Ações gerais'!$A$4:$A$203),\n   INDEX('Ações gerais'!$A$4:$A$203, ROW()-ROW($C$19)+1),\n   INDEX(Operacionalização!$A$4:$A$93, ROW()-ROW($C$19)+1 - ROWS('Ações gerais'!$A$4:$A$203))\n))","v":0},null,{"$f":"IF($F$18<>\"\",\n\"\",\nIF(OR($C123=\"\",$C123=0),\n   \"\",\n   IF(COUNTIF($C$19:C123,C123)=1,C123,\"\")\n))","v":""}]
[{"$f":"IF($F$18<>\"\",\n$F$18,\nIFERROR(\n   INDEX($E$19:$E$308,\n      _xlfn.AGGREGATE(15,6,\n         (ROW($E$19:$E$308)-ROW($E$19)+1)/($E$19:$E$308<>\"\"),\n         ROW()-ROW($A$19)+1\n      )\n   ),\n\"\"))","v":""},null,{"$f":"IF($F$18<>\"\",\n\"\",\nIF(ROW()-ROW($C$19)+1<=ROWS('Ações gerais'!$A$4:$A$203),\n   INDEX('Ações gerais'!$A$4:$A$203, ROW()-ROW($C$19)+1),\n   INDEX(Operacionalização!$A$4:$A$93, ROW()-ROW($C$19)+1 - ROWS('Ações gerais'!$A$4:$A$203))\n))","v":0},null,{"$f":"IF($F$18<>\"\",\n\"\",\nIF(OR($C124=\"\",$C124=0),\n   \"\",\n   IF(COUNTIF($C$19:C124,C124)=1,C124,\"\")\n))","v":""}]
[{"$f":"IF($F$18<>\"\",\n$F$18,\nIFERROR(\n   INDEX($E$19:$E$308,\n      _xlfn.AGGREGATE(15,6,\n         (ROW($E$19:$E$308)-ROW($E$19)+1)/($E$19:$E$308<>\"\"),\n         ROW()-ROW($A$19)+1\n      )\n   ),\n\"\"))","v":""},null,{"$f":"IF($F$18<>\"\",\n\"\",\nIF(ROW()-ROW($C$19)+1<=ROWS('Ações gerais'!$A$4:$A$203),\n   INDEX('Ações gerais'!$A$4:$A$203, ROW()-ROW($C$19)+1),\n   INDEX(Operacionalização!$A$4:$A$93, ROW()-ROW($C$19)+1 - ROWS('Ações gerais'!$A$4:$A$203))\n))","v":0},null,{"$f":"IF($F$18<>\"\",\n\"\",\nIF(OR($C125=\"\",$C125=0),\n   \"\",\n   IF(COUNTIF($C$19:C125,C125)=1,C125,\"\")\n))","v":""}]
[{"$f":"IF($F$18<>\"\",\n$F$18,\nIFERROR(\n   INDEX($E$19:$E$308,\n      _xlfn.AGGREGATE(15,6,\n         (ROW($E$19:$E$308)-ROW($E$19)+1)/($E$19:$E$308<>\"\"),\n         ROW()-ROW($A$19)+1\n      )\n   ),\n\"\"))","v":""},null,{"$f":"IF($F$18<>\"\",\n\"\",\nIF(ROW()-ROW($C$19)+1<=ROWS('Ações gerais'!$A$4:$A$203),\n   INDEX('Ações gerais'!$A$4:$A$203, ROW()-ROW($C$19)+1),\n   INDEX(Operacionalização!$A$4:$A$93, ROW()-ROW($C$19)+1 - ROWS('Ações gerais'!$A$4:$A$203))\n))","v":0},null,{"$f":"IF($F$18<>\"\",\n\"\",\nIF(OR($C126=\"\",$C126=0),\n   \"\",\n   IF(COUNTIF($C$19:C126,C126)=1,C126,\"\")\n))","v":""}]
[{"$f":"IF($F$18<>\"\",\n$F$18,\nIFERROR(\n   INDEX($E$19:$E$308,\n      _xlfn.AGGREGATE(15,6,\n         (ROW($E$19:$E$308)-ROW($E$19)+1)/($E$19:$E$308<>\"\"),\n         ROW()-ROW($A$19)+1\n      )\n   ),\n\"\"))","v":""},null,{"$f":"IF($F$18<>\"\",\n\"\",\nIF(ROW()-ROW($C$19)+1<=ROWS('Ações gerais'!$A$4:$A$203),\n   INDEX('Ações gerais'!$A$4:$A$203, ROW()-ROW($C$19)+1),\n   INDEX(Operacionalização!$A$4:$A$93, ROW()-ROW($C$19)+1 - ROWS('Ações gerais'!$A$4:$A$203))\n))","v":0},null,{"$f":"IF($F$18<>\"\",\n\"\",\nIF(OR($C127=\"\",$C127=0),\n   \"\",\n   IF(COUNTIF($C$19:C127,C127)=1,C127,\"\")\n))","v":""}]
[{"$f":"IF($F$18<>\"\",\n$F$18,\nIFERROR(\n   INDEX($E$19:$E$308,\n      _xlfn.AGGREGATE(15,6,\n         (ROW($E$19:$E$308)-ROW($E$19)+1)/($E$19:$E$308<>\"\"),\n         ROW()-ROW($A$19)+1\n      )\n   ),\n\"\"))","v":""},null,{"$f":"IF($F$18<>\"\",\n\"\",\nIF(ROW()-ROW($C$19)+1<=ROWS('Ações gerais'!$A$4:$A$203),\n   INDEX('Ações gerais'!$A$4:$A$203, ROW()-ROW($C$19)+1),\n   INDEX(Operacionalização!$A$4:$A$93, ROW()-ROW($C$19)+1 - ROWS('Ações gerais'!$A$4:$A$203))\n))","v":0},null,{"$f":"IF($F$18<>\"\",\n\"\",\nIF(OR($C128=\"\",$C128=0),\n   \"\",\n   IF(COUNTIF($C$19:C128,C128)=1,C128,\"\")\n))","v":""}]
[{"$f":"IF($F$18<>\"\",\n$F$18,\nIFERROR(\n   INDEX($E$19:$E$308,\n      _xlfn.AGGREGATE(15,6,\n         (ROW($E$19:$E$308)-ROW($E$19)+1)/($E$19:$E$308<>\"\"),\n         ROW()-ROW($A$19)+1\n      )\n   ),\n\"\"))","v":""},null,{"$f":"IF($F$18<>\"\",\n\"\",\nIF(ROW()-ROW($C$19)+1<=ROWS('Ações gerais'!$A$4:$A$203),\n   INDEX('Ações gerais'!$A$4:$A$203, ROW()-ROW($C$19)+1),\n   INDEX(Operacionalização!$A$4:$A$93, ROW()-ROW($C$19)+1 - ROWS('Ações gerais'!$A$4:$A$203))\n))","v":0},null,{"$f":"IF($F$18<>\"\",\n\"\",\nIF(OR($C129=\"\",$C129=0),\n   \"\",\n   IF(COUNTIF($C$19:C129,C129)=1,C129,\"\")\n))","v":""}]
[{"$f":"IF($F$18<>\"\",\n$F$18,\nIFERROR(\n   INDEX($E$19:$E$308,\n      _xlfn.AGGREGATE(15,6,\n         (ROW($E$19:$E$308)-ROW($E$19)+1)/($E$19:$E$308<>\"\"),\n         ROW()-ROW($A$19)+1\n      )\n   ),\n\"\"))","v":""},null,{"$f":"IF($F$18<>\"\",\n\"\",\nIF(ROW()-ROW($C$19)+1<=ROWS('Ações gerais'!$A$4:$A$203),\n   INDEX('Ações gerais'!$A$4:$A$203, ROW()-ROW($C$19)+1),\n   INDEX(Operacionalização!$A$4:$A$93, ROW()-ROW($C$19)+1 - ROWS('Ações gerais'!$A$4:$A$203))\n))","v":0},null,{"$f":"IF($F$18<>\"\",\n\"\",\nIF(OR($C130=\"\",$C130=0),\n   \"\",\n   IF(COUNTIF($C$19:C130,C130)=1,C130,\"\")\n))","v":""}]
[{"$f":"IF($F$18<>\"\",\n$F$18,\nIFERROR(\n   INDEX($E$19:$E$308,\n      _xlfn.AGGREGATE(15,6,\n         (ROW($E$19:$E$308)-ROW($E$19)+1)/($E$19:$E$308<>\"\"),\n         ROW()-ROW($A$19)+1\n      )\n   ),\n\"\"))","v":""},null,{"$f":"IF($F$18<>\"\",\n\"\",\nIF(ROW()-ROW($C$19)+1<=ROWS('Ações gerais'!$A$4:$A$203),\n   INDEX('Ações gerais'!$A$4:$A$203, ROW()-ROW($C$19)+1),\n   INDEX(Operacionalização!$A$4:$A$93, ROW()-ROW($C$19)+1 - ROWS('Ações gerais'!$A$4:$A$203))\n))","v":0},null,{"$f":"IF($F$18<>\"\",\n\"\",\nIF(OR($C131=\"\",$C131=0),\n   \"\",\n   IF(COUNTIF($C$19:C131,C131)=1,C131,\"\")\n))","v":""}]
[{"$f":"IF($F$18<>\"\",\n$F$18,\nIFERROR(\n   INDEX($E$19:$E$308,\n      _xlfn.AGGREGATE(15,6,\n         (ROW($E$19:$E$308)-ROW($E$19)+1)/($E$19:$E$308<>\"\"),\n         ROW()-ROW($A$19)+1\n      )\n   ),\n\"\"))","v":""},null,{"$f":"IF($F$18<>\"\",\n\"\",\nIF(ROW()-ROW($C$19)+1<=ROWS('Ações gerais'!$A$4:$A$203),\n   INDEX('Ações gerais'!$A$4:$A$203, ROW()-ROW($C$19)+1),\n   INDEX(Operacionalização!$A$4:$A$93, ROW()-ROW($C$19)+1 - ROWS('Ações gerais'!$A$4:$A$203))\n))","v":0},null,{"$f":"IF($F$18<>\"\",\n\"\",\nIF(OR($C132=\"\",$C132=0),\n   \"\",\n   IF(COUNTIF($C$19:C132,C132)=1,C132,\"\")\n))","v":""}]
[{"$f":"IF($F$18<>\"\",\n$F$18,\nIFERROR(\n   INDEX($E$19:$E$308,\n      _xlfn.AGGREGATE(15,6,\n         (ROW($E$19:$E$308)-ROW($E$19)+1)/($E$19:$E$308<>\"\"),\n         ROW()-ROW($A$19)+1\n      )\n   ),\n\"\"))","v":""},null,{"$f":"IF($F$18<>\"\",\n\"\",\nIF(ROW()-ROW($C$19)+1<=ROWS('Ações gerais'!$A$4:$A$203),\n   INDEX('Ações gerais'!$A$4:$A$203, ROW()-ROW($C$19)+1),\n   INDEX(Operacionalização!$A$4:$A$93, ROW()-ROW($C$19)+1 - ROWS('Ações gerais'!$A$4:$A$203))\n))","v":0},null,{"$f":"IF($F$18<>\"\",\n\"\",\nIF(OR($C133=\"\",$C133=0),\n   \"\",\n   IF(COUNTIF($C$19:C133,C133)=1,C133,\"\")\n))","v":""}]
[{"$f":"IF($F$18<>\"\",\n$F$18,\nIFERROR(\n   INDEX($E$19:$E$308,\n      _xlfn.AGGREGATE(15,6,\n         (ROW($E$19:$E$308)-ROW($E$19)+1)/($E$19:$E$308<>\"\"),\n         ROW()-ROW($A$19)+1\n      )\n   ),\n\"\"))","v":""},null,{"$f":"IF($F$18<>\"\",\n\"\",\nIF(ROW()-ROW($C$19)+1<=ROWS('Ações gerais'!$A$4:$A$203),\n   INDEX('Ações gerais'!$A$4:$A$203, ROW()-ROW($C$19)+1),\n   INDEX(Operacionalização!$A$4:$A$93, ROW()-ROW($C$19)+1 - ROWS('Ações gerais'!$A$4:$A$203))\n))","v":0},null,{"$f":"IF($F$18<>\"\",\n\"\",\nIF(OR($C134=\"\",$C134=0),\n   \"\",\n   IF(COUNTIF($C$19:C134,C134)=1,C134,\"\")\n))","v":""}]
[{"$f":"IF($F$18<>\"\",\n$F$18,\nIFERROR(\n   INDEX($E$19:$E$308,\n      _xlfn.AGGREGATE(15,6,\n         (ROW($E$19:$E$308)-ROW($E$19)+1)/($E$19:$E$308<>\"\"),\n         ROW()-ROW($A$19)+1\n      )\n   ),\n\"\"))","v":""},null,{"$f":"IF($F$18<>\"\",\n\"\",\nIF(ROW()-ROW($C$19)+1<=ROWS('Ações gerais'!$A$4:$A$203),\n   INDEX('Ações gerais'!$A$4:$A$203, ROW()-ROW($C$19)+1),\n   INDEX(Operacionalização!$A$4:$A$93, ROW()-ROW($C$19)+1 - ROWS('Ações gerais'!$A$4:$A$203))\n))","v":0},null,{"$f":"IF($F$18<>\"\",\n\"\",\nIF(OR($C135=\"\",$C135=0),\n   \"\",\n   IF(COUNTIF($C$19:C135,C135)=1,C135,\"\")\n))","v":""}]
[{"$f":"IF($F$18<>\"\",\n$F$18,\nIFERROR(\n   INDEX($E$19:$E$308,\n      _xlfn.AGGREGATE(15,6,\n         (ROW($E$19:$E$308)-ROW($E$19)+1)/($E$19:$E$308<>\"\"),\n         ROW()-ROW($A$19)+1\n      )\n   ),\n\"\"))","v":""},null,{"$f":"IF($F$18<>\"\",\n\"\",\nIF(ROW()-ROW($C$19)+1<=ROWS('Ações gerais'!$A$4:$A$203),\n   INDEX('Ações gerais'!$A$4:$A$203, ROW()-ROW($C$19)+1),\n   INDEX(Operacionalização!$A$4:$A$93, ROW()-ROW($C$19)+1 - ROWS('Ações gerais'!$A$4:$A$203))\n))","v":0},null,{"$f":"IF($F$18<>\"\",\n\"\",\nIF(OR($C136=\"\",$C136=0),\n   \"\",\n   IF(COUNTIF($C$19:C136,C136)=1,C136,\"\")\n))","v":""}]
[{"$f":"IF($F$18<>\"\",\n$F$18,\nIFERROR(\n   INDEX($E$19:$E$308,\n      _xlfn.AGGREGATE(15,6,\n         (ROW($E$19:$E$308)-ROW($E$19)+1)/($E$19:$E$308<>\"\"),\n         ROW()-ROW($A$19)+1\n      )\n   ),\n\"\"))","v":""},null,{"$f":"IF($F$18<>\"\",\n\"\",\nIF(ROW()-ROW($C$19)+1<=ROWS('Ações gerais'!$A$4:$A$203),\n   INDEX('Ações gerais'!$A$4:$A$203, ROW()-ROW($C$19)+1),\n   INDEX(Operacionalização!$A$4:$A$93, ROW()-ROW($C$19)+1 - ROWS('Ações gerais'!$A$4:$A$203))\n))","v":0},null,{"$f":"IF($F$18<>\"\",\n\"\",\nIF(OR($C137=\"\",$C137=0),\n   \"\",\n   IF(COUNTIF($C$19:C137,C137)=1,C137,\"\")\n))","v":""}]
[{"$f":"IF($F$18<>\"\",\n$F$18,\nIFERROR(\n   INDEX($E$19:$E$308,\n      _xlfn.AGGREGATE(15,6,\n         (ROW($E$19:$E$308)-ROW($E$19)+1)/($E$19:$E$308<>\"\"),\n         ROW()-ROW($A$19)+1\n      )\n   ),\n\"\"))","v":""},null,{"$f":"IF($F$18<>\"\",\n\"\",\nIF(ROW()-ROW($C$19)+1<=ROWS('Ações gerais'!$A$4:$A$203),\n   INDEX('Ações gerais'!$A$4:$A$203, ROW()-ROW($C$19)+1),\n   INDEX(Operacionalização!$A$4:$A$93, ROW()-ROW($C$19)+1 - ROWS('Ações gerais'!$A$4:$A$203))\n))","v":0},null,{"$f":"IF($F$18<>\"\",\n\"\",\nIF(OR($C138=\"\",$C138=0),\n   \"\",\n   IF(COUNTIF($C$19:C138,C138)=1,C138,\"\")\n))","v":""}]
[{"$f":"IF($F$18<>\"\",\n$F$18,\nIFERROR(\n   INDEX($E$19:$E$308,\n      _xlfn.AGGREGATE(15,6,\n         (ROW($E$19:$E$308)-ROW($E$19)+1)/($E$19:$E$308<>\"\"),\n         ROW()-ROW($A$19)+1\n      )\n   ),\n\"\"))","v":""},null,{"$f":"IF($F$18<>\"\",\n\"\",\nIF(ROW()-ROW($C$19)+1<=ROWS('Ações gerais'!$A$4:$A$203),\n   INDEX('Ações gerais'!$A$4:$A$203, ROW()-ROW($C$19)+1),\n   INDEX(Operacionalização!$A$4:$A$93, ROW()-ROW($C$19)+1 - ROWS('Ações gerais'!$A$4:$A$203))\n))","v":0},null,{"$f":"IF($F$18<>\"\",\n\"\",\nIF(OR($C139=\"\",$C139=0),\n   \"\",\n   IF(COUNTIF($C$19:C139,C139)=1,C139,\"\")\n))","v":""}]
[{"$f":"IF($F$18<>\"\",\n$F$18,\nIFERROR(\n   INDEX($E$19:$E$308,\n      _xlfn.AGGREGATE(15,6,\n         (ROW($E$19:$E$308)-ROW($E$19)+1)/($E$19:$E$308<>\"\"),\n         ROW()-ROW($A$19)+1\n      )\n   ),\n\"\"))","v":""},null,{"$f":"IF($F$18<>\"\",\n\"\",\nIF(ROW()-ROW($C$19)+1<=ROWS('Ações gerais'!$A$4:$A$203),\n   INDEX('Ações gerais'!$A$4:$A$203, ROW()-ROW($C$19)+1),\n   INDEX(Operacionalização!$A$4:$A$93, ROW()-ROW($C$19)+1 - ROWS('Ações gerais'!$A$4:$A$203))\n))","v":0},null,{"$f":"IF($F$18<>\"\",\n\"\",\nIF(OR($C140=\"\",$C140=0),\n   \"\",\n   IF(COUNTIF($C$19:C140,C140)=1,C140,\"\")\n))","v":""}]
[{"$f":"IF($F$18<>\"\",\n$F$18,\nIFERROR(\n   INDEX($E$19:$E$308,\n      _xlfn.AGGREGATE(15,6,\n         (ROW($E$19:$E$308)-ROW($E$19)+1)/($E$19:$E$308<>\"\"),\n         ROW()-ROW($A$19)+1\n      )\n   ),\n\"\"))","v":""},null,{"$f":"IF($F$18<>\"\",\n\"\",\nIF(ROW()-ROW($C$19)+1<=ROWS('Ações gerais'!$A$4:$A$203),\n   INDEX('Ações gerais'!$A$4:$A$203, ROW()-ROW($C$19)+1),\n   INDEX(Operacionalização!$A$4:$A$93, ROW()-ROW($C$19)+1 - ROWS('Ações gerais'!$A$4:$A$203))\n))","v":0},null,{"$f":"IF($F$18<>\"\",\n\"\",\nIF(OR($C141=\"\",$C141=0),\n   \"\",\n   IF(COUNTIF($C$19:C141,C141)=1,C141,\"\")\n))","v":""}]
[{"$f":"IF($F$18<>\"\",\n$F$18,\nIFERROR(\n   INDEX($E$19:$E$308,\n      _xlfn.AGGREGATE(15,6,\n         (ROW($E$19:$E$308)-ROW($E$19)+1)/($E$19:$E$308<>\"\"),\n         ROW()-ROW($A$19)+1\n      )\n   ),\n\"\"))","v":""},null,{"$f":"IF($F$18<>\"\",\n\"\",\nIF(ROW()-ROW($C$19)+1<=ROWS('Ações gerais'!$A$4:$A$203),\n   INDEX('Ações gerais'!$A$4:$A$203, ROW()-ROW($C$19)+1),\n   INDEX(Operacionalização!$A$4:$A$93, ROW()-ROW($C$19)+1 - ROWS('Ações gerais'!$A$4:$A$203))\n))","v":0},null,{"$f":"IF($F$18<>\"\",\n\"\",\nIF(OR($C142=\"\",$C142=0),\n   \"\",\n   IF(COUNTIF($C$19:C142,C142)=1,C142,\"\")\n))","v":""}]
[{"$f":"IF($F$18<>\"\",\n$F$18,\nIFERROR(\n   INDEX($E$19:$E$308,\n      _xlfn.AGGREGATE(15,6,\n         (ROW($E$19:$E$308)-ROW($E$19)+1)/($E$19:$E$308<>\"\"),\n         ROW()-ROW($A$19)+1\n      )\n   ),\n\"\"))","v":""},null,{"$f":"IF($F$18<>\"\",\n\"\",\nIF(ROW()-ROW($C$19)+1<=ROWS('Ações gerais'!$A$4:$A$203),\n   INDEX('Ações gerais'!$A$4:$A$203, ROW()-ROW($C$19)+1),\n   INDEX(Operacionalização!$A$4:$A$93, ROW()-ROW($C$19)+1 - ROWS('Ações gerais'!$A$4:$A$203))\n))","v":0},null,{"$f":"IF($F$18<>\"\",\n\"\",\nIF(OR($C143=\"\",$C143=0),\n   \"\",\n   IF(COUNTIF($C$19:C143,C143)=1,C143,\"\")\n))","v":""}]
[{"$f":"IF($F$18<>\"\",\n$F$18,\nIFERROR(\n   INDEX($E$19:$E$308,\n      _xlfn.AGGREGATE(15,6,\n         (ROW($E$19:$E$308)-ROW($E$19)+1)/($E$19:$E$308<>\"\"),\n         ROW()-ROW($A$19)+1\n      )\n   ),\n\"\"))","v":""},null,{"$f":"IF($F$18<>\"\",\n\"\",\nIF(ROW()-ROW($C$19)+1<=ROWS('Ações gerais'!$A$4:$A$203),\n   INDEX('Ações gerais'!$A$4:$A$203, ROW()-ROW($C$19)+1),\n   INDEX(Operacionalização!$A$4:$A$93, ROW()-ROW($C$19)+1 - ROWS('Ações gerais'!$A$4:$A$203))\n))","v":0},null,{"$f":"IF($F$18<>\"\",\n\"\",\nIF(OR($C144=\"\",$C144=0),\n   \"\",\n   IF(COUNTIF($C$19:C144,C144)=1,C144,\"\")\n))","v":""}]
[{"$f":"IF($F$18<>\"\",\n$F$18,\nIFERROR(\n   INDEX($E$19:$E$308,\n      _xlfn.AGGREGATE(15,6,\n         (ROW($E$19:$E$308)-ROW($E$19)+1)/($E$19:$E$308<>\"\"),\n         ROW()-ROW($A$19)+1\n      )\n   ),\n\"\"))","v":""},null,{"$f":"IF($F$18<>\"\",\n\"\",\nIF(ROW()-ROW($C$19)+1<=ROWS('Ações gerais'!$A$4:$A$203),\n   INDEX('Ações gerais'!$A$4:$A$203, ROW()-ROW($C$19)+1),\n   INDEX(Operacionalização!$A$4:$A$93, ROW()-ROW($C$19)+1 - ROWS('Ações gerais'!$A$4:$A$203))\n))","v":0},null,{"$f":"IF($F$18<>\"\",\n\"\",\nIF(OR($C145=\"\",$C145=0),\n   \"\",\n   IF(COUNTIF($C$19:C145,C145)=1,C145,\"\")\n))","v":""}]
[{"$f":"IF($F$18<>\"\",\n$F$18,\nIFERROR(\n   INDEX($E$19:$E$308,\n      _xlfn.AGGREGATE(15,6,\n         (ROW($E$19:$E$308)-ROW($E$19)+1)/($E$19:$E$308<>\"\"),\n         ROW()-ROW($A$19)+1\n      )\n   ),\n\"\"))","v":""},null,{"$f":"IF($F$18<>\"\",\n\"\",\nIF(ROW()-ROW($C$19)+1<=ROWS('Ações gerais'!$A$4:$A$203),\n   INDEX('Ações gerais'!$A$4:$A$203, ROW()-ROW($C$19)+1),\n   INDEX(Operacionalização!$A$4:$A$93, ROW()-ROW($C$19)+1 - ROWS('Ações gerais'!$A$4:$A$203))\n))","v":0},null,{"$f":"IF($F$18<>\"\",\n\"\",\nIF(OR($C146=\"\",$C146=0),\n   \"\",\n   IF(COUNTIF($C$19:C146,C146)=1,C146,\"\")\n))","v":""}]
[{"$f":"IF($F$18<>\"\",\n$F$18,\nIFERROR(\n   INDEX($E$19:$E$308,\n      _xlfn.AGGREGATE(15,6,\n         (ROW($E$19:$E$308)-ROW($E$19)+1)/($E$19:$E$308<>\"\"),\n         ROW()-ROW($A$19)+1\n      )\n   ),\n\"\"))","v":""},null,{"$f":"IF($F$18<>\"\",\n\"\",\nIF(ROW()-ROW($C$19)+1<=ROWS('Ações gerais'!$A$4:$A$203),\n   INDEX('Ações gerais'!$A$4:$A$203, ROW()-ROW($C$19)+1),\n   INDEX(Operacionalização!$A$4:$A$93, ROW()-ROW($C$19)+1 - ROWS('Ações gerais'!$A$4:$A$203))\n))","v":0},null,{"$f":"IF($F$18<>\"\",\n\"\",\nIF(OR($C147=\"\",$C147=0),\n   \"\",\n   IF(COUNTIF($C$19:C147,C147)=1,C147,\"\")\n))","v":""}]
[{"$f":"IF($F$18<>\"\",\n$F$18,\nIFERROR(\n   INDEX($E$19:$E$308,\n      _xlfn.AGGREGATE(15,6,\n         (ROW($E$19:$E$308)-ROW($E$19)+1)/($E$19:$E$308<>\"\"),\n         ROW()-ROW($A$19)+1\n      )\n   ),\n\"\"))","v":""},null,{"$f":"IF($F$18<>\"\",\n\"\",\nIF(ROW()-ROW($C$19)+1<=ROWS('Ações gerais'!$A$4:$A$203),\n   INDEX('Ações gerais'!$A$4:$A$203, ROW()-ROW($C$19)+1),\n   INDEX(Operacionalização!$A$4:$A$93, ROW()-ROW($C$19)+1 - ROWS('Ações gerais'!$A$4:$A$203))\n))","v":0},null,{"$f":"IF($F$18<>\"\",\n\"\",\nIF(OR($C148=\"\",$C148=0),\n   \"\",\n   IF(COUNTIF($C$19:C148,C148)=1,C148,\"\")\n))","v":""}]
[{"$f":"IF($F$18<>\"\",\n$F$18,\nIFERROR(\n   INDEX($E$19:$E$308,\n      _xlfn.AGGREGATE(15,6,\n         (ROW($E$19:$E$308)-ROW($E$19)+1)/($E$19:$E$308<>\"\"),\n         ROW()-ROW($A$19)+1\n      )\n   ),\n\"\"))","v":""},null,{"$f":"IF($F$18<>\"\",\n\"\",\nIF(ROW()-ROW($C$19)+1<=ROWS('Ações gerais'!$A$4:$A$203),\n   INDEX('Ações gerais'!$A$4:$A$203, ROW()-ROW($C$19)+1),\n   INDEX(Operacionalização!$A$4:$A$93, ROW()-ROW($C$19)+1 - ROWS('Ações gerais'!$A$4:$A$203))\n))","v":0},null,{"$f":"IF($F$18<>\"\",\n\"\",\nIF(OR($C149=\"\",$C149=0),\n   \"\",\n   IF(COUNTIF($C$19:C149,C149)=1,C149,\"\")\n))","v":""}]
[{"$f":"IF($F$18<>\"\",\n$F$18,\nIFERROR(\n   INDEX($E$19:$E$308,\n      _xlfn.AGGREGATE(15,6,\n         (ROW($E$19:$E$308)-ROW($E$19)+1)/($E$19:$E$308<>\"\"),\n         ROW()-ROW($A$19)+1\n      )\n   ),\n\"\"))","v":""},null,{"$f":"IF($F$18<>\"\",\n\"\",\nIF(ROW()-ROW($C$19)+1<=ROWS('Ações gerais'!$A$4:$A$203),\n   INDEX('Ações gerais'!$A$4:$A$203, ROW()-ROW($C$19)+1),\n   INDEX(Operacionalização!$A$4:$A$93, ROW()-ROW($C$19)+1 - ROWS('Ações gerais'!$A$4:$A$203))\n))","v":0},null,{"$f":"IF($F$18<>\"\",\n\"\",\nIF(OR($C150=\"\",$C150=0),\n   \"\",\n   IF(COUNTIF($C$19:C150,C150)=1,C150,\"\")\n))","v":""}]
[{"$f":"IF($F$18<>\"\",\n$F$18,\nIFERROR(\n   INDEX($E$19:$E$308,\n      _xlfn.AGGREGATE(15,6,\n         (ROW($E$19:$E$308)-ROW($E$19)+1)/($E$19:$E$308<>\"\"),\n         ROW()-ROW($A$19)+1\n      )\n   ),\n\"\"))","v":""},null,{"$f":"IF($F$18<>\"\",\n\"\",\nIF(ROW()-ROW($C$19)+1<=ROWS('Ações gerais'!$A$4:$A$203),\n   INDEX('Ações gerais'!$A$4:$A$203, ROW()-ROW($C$19)+1),\n   INDEX(Operacionalização!$A$4:$A$93, ROW()-ROW($C$19)+1 - ROWS('Ações gerais'!$A$4:$A$203))\n))","v":0},null,{"$f":"IF($F$18<>\"\",\n\"\",\nIF(OR($C151=\"\",$C151=0),\n   \"\",\n   IF(COUNTIF($C$19:C151,C151)=1,C151,\"\")\n))","v":""}]
[{"$f":"IF($F$18<>\"\",\n$F$18,\nIFERROR(\n   INDEX($E$19:$E$308,\n      _xlfn.AGGREGATE(15,6,\n         (ROW($E$19:$E$308)-ROW($E$19)+1)/($E$19:$E$308<>\"\"),\n         ROW()-ROW($A$19)+1\n      )\n   ),\n\"\"))","v":""},null,{"$f":"IF($F$18<>\"\",\n\"\",\nIF(ROW()-ROW($C$19)+1<=ROWS('Ações gerais'!$A$4:$A$203),\n   INDEX('Ações gerais'!$A$4:$A$203, ROW()-ROW($C$19)+1),\n   INDEX(Operacionalização!$A$4:$A$93, ROW()-ROW($C$19)+1 - ROWS('Ações gerais'!$A$4:$A$203))\n))","v":0},null,{"$f":"IF($F$18<>\"\",\n\"\",\nIF(OR($C152=\"\",$C152=0),\n   \"\",\n   IF(COUNTIF($C$19:C152,C152)=1,C152,\"\")\n))","v":""}]
[{"$f":"IF($F$18<>\"\",\n$F$18,\nIFERROR(\n   INDEX($E$19:$E$308,\n      _xlfn.AGGREGATE(15,6,\n         (ROW($E$19:$E$308)-ROW($E$19)+1)/($E$19:$E$308<>\"\"),\n         ROW()-ROW($A$19)+1\n      )\n   ),\n\"\"))","v":""},null,{"$f":"IF($F$18<>\"\",\n\"\",\nIF(ROW()-ROW($C$19)+1<=ROWS('Ações gerais'!$A$4:$A$203),\n   INDEX('Ações gerais'!$A$4:$A$203, ROW()-ROW($C$19)+1),\n   INDEX(Operacionalização!$A$4:$A$93, ROW()-ROW($C$19)+1 - ROWS('Ações gerais'!$A$4:$A$203))\n))","v":0},null,{"$f":"IF($F$18<>\"\",\n\"\",\nIF(OR($C153=\"\",$C153=0),\n   \"\",\n   IF(COUNTIF($C$19:C153,C153)=1,C153,\"\")\n))","v":""}]
[{"$f":"IF($F$18<>\"\",\n$F$18,\nIFERROR(\n   INDEX($E$19:$E$308,\n      _xlfn.AGGREGATE(15,6,\n         (ROW($E$19:$E$308)-ROW($E$19)+1)/($E$19:$E$308<>\"\"),\n         ROW()-ROW($A$19)+1\n      )\n   ),\n\"\"))","v":""},null,{"$f":"IF($F$18<>\"\",\n\"\",\nIF(ROW()-ROW($C$19)+1<=ROWS('Ações gerais'!$A$4:$A$203),\n   INDEX('Ações gerais'!$A$4:$A$203, ROW()-ROW($C$19)+1),\n   INDEX(Operacionalização!$A$4:$A$93, ROW()-ROW($C$19)+1 - ROWS('Ações gerais'!$A$4:$A$203))\n))","v":0},null,{"$f":"IF($F$18<>\"\",\n\"\",\nIF(OR($C154=\"\",$C154=0),\n   \"\",\n   IF(COUNTIF($C$19:C154,C154)=1,C154,\"\")\n))","v":""}]
[{"$f":"IF($F$18<>\"\",\n$F$18,\nIFERROR(\n   INDEX($E$19:$E$308,\n      _xlfn.AGGREGATE(15,6,\n         (ROW($E$19:$E$308)-ROW($E$19)+1)/($E$19:$E$308<>\"\"),\n         ROW()-ROW($A$19)+1\n      )\n   ),\n\"\"))","v":""},null,{"$f":"IF($F$18<>\"\",\n\"\",\nIF(ROW()-ROW($C$19)+1<=ROWS('Ações gerais'!$A$4:$A$203),\n   INDEX('Ações gerais'!$A$4:$A$203, ROW()-ROW($C$19)+1),\n   INDEX(Operacionalização!$A$4:$A$93, ROW()-ROW($C$19)+1 - ROWS('Ações gerais'!$A$4:$A$203))\n))","v":0},null,{"$f":"IF($F$18<>\"\",\n\"\",\nIF(OR($C155=\"\",$C155=0),\n   \"\",\n   IF(COUNTIF($C$19:C155,C155)=1,C155,\"\")\n))","v":""}]
[{"$f":"IF($F$18<>\"\",\n$F$18,\nIFERROR(\n   INDEX($E$19:$E$308,\n      _xlfn.AGGREGATE(15,6,\n         (ROW($E$19:$E$308)-ROW($E$19)+1)/($E$19:$E$308<>\"\"),\n         ROW()-ROW($A$19)+1\n      )\n   ),\n\"\"))","v":""},null,{"$f":"IF($F$18<>\"\",\n\"\",\nIF(ROW()-ROW($C$19)+1<=ROWS('Ações gerais'!$A$4:$A$203),\n   INDEX('Ações gerais'!$A$4:$A$203, ROW()-ROW($C$19)+1),\n   INDEX(Operacionalização!$A$4:$A$93, ROW()-ROW($C$19)+1 - ROWS('Ações gerais'!$A$4:$A$203))\n))","v":0},null,{"$f":"IF($F$18<>\"\",\n\"\",\nIF(OR($C156=\"\",$C156=0),\n   \"\",\n   IF(COUNTIF($C$19:C156,C156)=1,C156,\"\")\n))","v":""}]
[{"$f":"IF($F$18<>\"\",\n$F$18,\nIFERROR(\n   INDEX($E$19:$E$308,\n      _xlfn.AGGREGATE(15,6,\n         (ROW($E$19:$E$308)-ROW($E$19)+1)/($E$19:$E$308<>\"\"),\n         ROW()-ROW($A$19)+1\n      )\n   ),\n\"\"))","v":""},null,{"$f":"IF($F$18<>\"\",\n\"\",\nIF(ROW()-ROW($C$19)+1<=ROWS('Ações gerais'!$A$4:$A$203),\n   INDEX('Ações gerais'!$A$4:$A$203, ROW()-ROW($C$19)+1),\n   INDEX(Operacionalização!$A$4:$A$93, ROW()-ROW($C$19)+1 - ROWS('Ações gerais'!$A$4:$A$203))\n))","v":0},null,{"$f":"IF($F$18<>\"\",\n\"\",\nIF(OR($C157=\"\",$C157=0),\n   \"\",\n   IF(COUNTIF($C$19:C157,C157)=1,C157,\"\")\n))","v":""}]
[{"$f":"IF($F$18<>\"\",\n$F$18,\nIFERROR(\n   INDEX($E$19:$E$308,\n      _xlfn.AGGREGATE(15,6,\n         (ROW($E$19:$E$308)-ROW($E$19)+1)/($E$19:$E$308<>\"\"),\n         ROW()-ROW($A$19)+1\n      )\n   ),\n\"\"))","v":""},null,{"$f":"IF($F$18<>\"\",\n\"\",\nIF(ROW()-ROW($C$19)+1<=ROWS('Ações gerais'!$A$4:$A$203),\n   INDEX('Ações gerais'!$A$4:$A$203, ROW()-ROW($C$19)+1),\n   INDEX(Operacionalização!$A$4:$A$93, ROW()-ROW($C$19)+1 - ROWS('Ações gerais'!$A$4:$A$203))\n))","v":0},null,{"$f":"IF($F$18<>\"\",\n\"\",\nIF(OR($C158=\"\",$C158=0),\n   \"\",\n   IF(COUNTIF($C$19:C158,C158)=1,C158,\"\")\n))","v":""}]
[{"$f":"IF($F$18<>\"\",\n$F$18,\nIFERROR(\n   INDEX($E$19:$E$308,\n      _xlfn.AGGREGATE(15,6,\n         (ROW($E$19:$E$308)-ROW($E$19)+1)/($E$19:$E$308<>\"\"),\n         ROW()-ROW($A$19)+1\n      )\n   ),\n\"\"))","v":""},null,{"$f":"IF($F$18<>\"\",\n\"\",\nIF(ROW()-ROW($C$19)+1<=ROWS('Ações gerais'!$A$4:$A$203),\n   INDEX('Ações gerais'!$A$4:$A$203, ROW()-ROW($C$19)+1),\n   INDEX(Operacionalização!$A$4:$A$93, ROW()-ROW($C$19)+1 - ROWS('Ações gerais'!$A$4:$A$203))\n))","v":0},null,{"$f":"IF($F$18<>\"\",\n\"\",\nIF(OR($C159=\"\",$C159=0),\n   \"\",\n   IF(COUNTIF($C$19:C159,C159)=1,C159,\"\")\n))","v":""}]
[{"$f":"IF($F$18<>\"\",\n$F$18,\nIFERROR(\n   INDEX($E$19:$E$308,\n      _xlfn.AGGREGATE(15,6,\n         (ROW($E$19:$E$308)-ROW($E$19)+1)/($E$19:$E$308<>\"\"),\n         ROW()-ROW($A$19)+1\n      )\n   ),\n\"\"))","v":""},null,{"$f":"IF($F$18<>\"\",\n\"\",\nIF(ROW()-ROW($C$19)+1<=ROWS('Ações gerais'!$A$4:$A$203),\n   INDEX('Ações gerais'!$A$4:$A$203, ROW()-ROW($C$19)+1),\n   INDEX(Operacionalização!$A$4:$A$93, ROW()-ROW($C$19)+1 - ROWS('Ações gerais'!$A$4:$A$203))\n))","v":0},null,{"$f":"IF($F$18<>\"\",\n\"\",\nIF(OR($C160=\"\",$C160=0),\n   \"\",\n   IF(COUNTIF($C$19:C160,C160)=1,C160,\"\")\n))","v":""}]
[{"$f":"IF($F$18<>\"\",\n$F$18,\nIFERROR(\n   INDEX($E$19:$E$308,\n      _xlfn.AGGREGATE(15,6,\n         (ROW($E$19:$E$308)-ROW($E$19)+1)/($E$19:$E$308<>\"\"),\n         ROW()-ROW($A$19)+1\n      )\n   ),\n\"\"))","v":""},null,{"$f":"IF($F$18<>\"\",\n\"\",\nIF(ROW()-ROW($C$19)+1<=ROWS('Ações gerais'!$A$4:$A$203),\n   INDEX('Ações gerais'!$A$4:$A$203, ROW()-ROW($C$19)+1),\n   INDEX(Operacionalização!$A$4:$A$93, ROW()-ROW($C$19)+1 - ROWS('Ações gerais'!$A$4:$A$203))\n))","v":0},null,{"$f":"IF($F$18<>\"\",\n\"\",\nIF(OR($C161=\"\",$C161=0),\n   \"\",\n   IF(COUNTIF($C$19:C161,C161)=1,C161,\"\")\n))","v":""}]
[{"$f":"IF($F$18<>\"\",\n$F$18,\nIFERROR(\n   INDEX($E$19:$E$308,\n      _xlfn.AGGREGATE(15,6,\n         (ROW($E$19:$E$308)-ROW($E$19)+1)/($E$19:$E$308<>\"\"),\n         ROW()-ROW($A$19)+1\n      )\n   ),\n\"\"))","v":""},null,{"$f":"IF($F$18<>\"\",\n\"\",\nIF(ROW()-ROW($C$19)+1<=ROWS('Ações gerais'!$A$4:$A$203),\n   INDEX('Ações gerais'!$A$4:$A$203, ROW()-ROW($C$19)+1),\n   INDEX(Operacionalização!$A$4:$A$93, ROW()-ROW($C$19)+1 - ROWS('Ações gerais'!$A$4:$A$203))\n))","v":0},null,{"$f":"IF($F$18<>\"\",\n\"\",\nIF(OR($C162=\"\",$C162=0),\n   \"\",\n   IF(COUNTIF($C$19:C162,C162)=1,C162,\"\")\n))","v":""}]
[{"$f":"IF($F$18<>\"\",\n$F$18,\nIFERROR(\n   INDEX($E$19:$E$308,\n      _xlfn.AGGREGATE(15,6,\n         (ROW($E$19:$E$308)-ROW($E$19)+1)/($E$19:$E$308<>\"\"),\n         ROW()-ROW($A$19)+1\n      )\n   ),\n\"\"))","v":""},null,{"$f":"IF($F$18<>\"\",\n\"\",\nIF(ROW()-ROW($C$19)+1<=ROWS('Ações gerais'!$A$4:$A$203),\n   INDEX('Ações gerais'!$A$4:$A$203, ROW()-ROW($C$19)+1),\n   INDEX(Operacionalização!$A$4:$A$93, ROW()-ROW($C$19)+1 - ROWS('Ações gerais'!$A$4:$A$203))\n))","v":0},null,{"$f":"IF($F$18<>\"\",\n\"\",\nIF(OR($C163=\"\",$C163=0),\n   \"\",\n   IF(COUNTIF($C$19:C163,C163)=1,C163,\"\")\n))","v":""}]
[{"$f":"IF($F$18<>\"\",\n$F$18,\nIFERROR(\n   INDEX($E$19:$E$308,\n      _xlfn.AGGREGATE(15,6,\n         (ROW($E$19:$E$308)-ROW($E$19)+1)/($E$19:$E$308<>\"\"),\n         ROW()-ROW($A$19)+1\n      )\n   ),\n\"\"))","v":""},null,{"$f":"IF($F$18<>\"\",\n\"\",\nIF(ROW()-ROW($C$19)+1<=ROWS('Ações gerais'!$A$4:$A$203),\n   INDEX('Ações gerais'!$A$4:$A$203, ROW()-ROW($C$19)+1),\n   INDEX(Operacionalização!$A$4:$A$93, ROW()-ROW($C$19)+1 - ROWS('Ações gerais'!$A$4:$A$203))\n))","v":0},null,{"$f":"IF($F$18<>\"\",\n\"\",\nIF(OR($C164=\"\",$C164=0),\n   \"\",\n   IF(COUNTIF($C$19:C164,C164)=1,C164,\"\")\n))","v":""}]
[{"$f":"IF($F$18<>\"\",\n$F$18,\nIFERROR(\n   INDEX($E$19:$E$308,\n      _xlfn.AGGREGATE(15,6,\n         (ROW($E$19:$E$308)-ROW($E$19)+1)/($E$19:$E$308<>\"\"),\n         ROW()-ROW($A$19)+1\n      )\n   ),\n\"\"))","v":""},null,{"$f":"IF($F$18<>\"\",\n\"\",\nIF(ROW()-ROW($C$19)+1<=ROWS('Ações gerais'!$A$4:$A$203),\n   INDEX('Ações gerais'!$A$4:$A$203, ROW()-ROW($C$19)+1),\n   INDEX(Operacionalização!$A$4:$A$93, ROW()-ROW($C$19)+1 - ROWS('Ações gerais'!$A$4:$A$203))\n))","v":0},null,{"$f":"IF($F$18<>\"\",\n\"\",\nIF(OR($C165=\"\",$C165=0),\n   \"\",\n   IF(COUNTIF($C$19:C165,C165)=1,C165,\"\")\n))","v":""}]
[{"$f":"IF($F$18<>\"\",\n$F$18,\nIFERROR(\n   INDEX($E$19:$E$308,\n      _xlfn.AGGREGATE(15,6,\n         (ROW($E$19:$E$308)-ROW($E$19)+1)/($E$19:$E$308<>\"\"),\n         ROW()-ROW($A$19)+1\n      )\n   ),\n\"\"))","v":""},null,{"$f":"IF($F$18<>\"\",\n\"\",\nIF(ROW()-ROW($C$19)+1<=ROWS('Ações gerais'!$A$4:$A$203),\n   INDEX('Ações gerais'!$A$4:$A$203, ROW()-ROW($C$19)+1),\n   INDEX(Operacionalização!$A$4:$A$93, ROW()-ROW($C$19)+1 - ROWS('Ações gerais'!$A$4:$A$203))\n))","v":0},null,{"$f":"IF($F$18<>\"\",\n\"\",\nIF(OR($C166=\"\",$C166=0),\n   \"\",\n   IF(COUNTIF($C$19:C166,C166)=1,C166,\"\")\n))","v":""}]
[{"$f":"IF($F$18<>\"\",\n$F$18,\nIFERROR(\n   INDEX($E$19:$E$308,\n      _xlfn.AGGREGATE(15,6,\n         (ROW($E$19:$E$308)-ROW($E$19)+1)/($E$19:$E$308<>\"\"),\n         ROW()-ROW($A$19)+1\n      )\n   ),\n\"\"))","v":""},null,{"$f":"IF($F$18<>\"\",\n\"\",\nIF(ROW()-ROW($C$19)+1<=ROWS('Ações gerais'!$A$4:$A$203),\n   INDEX('Ações gerais'!$A$4:$A$203, ROW()-ROW($C$19)+1),\n   INDEX(Operacionalização!$A$4:$A$93, ROW()-ROW($C$19)+1 - ROWS('Ações gerais'!$A$4:$A$203))\n))","v":0},null,{"$f":"IF($F$18<>\"\",\n\"\",\nIF(OR($C167=\"\",$C167=0),\n   \"\",\n   IF(COUNTIF($C$19:C167,C167)=1,C167,\"\")\n))","v":""}]
[{"$f":"IF($F$18<>\"\",\n$F$18,\nIFERROR(\n   INDEX($E$19:$E$308,\n      _xlfn.AGGREGATE(15,6,\n         (ROW($E$19:$E$308)-ROW($E$19)+1)/($E$19:$E$308<>\"\"),\n         ROW()-ROW($A$19)+1\n      )\n   ),\n\"\"))","v":""},null,{"$f":"IF($F$18<>\"\",\n\"\",\nIF(ROW()-ROW($C$19)+1<=ROWS('Ações gerais'!$A$4:$A$203),\n   INDEX('Ações gerais'!$A$4:$A$203, ROW()-ROW($C$19)+1),\n   INDEX(Operacionalização!$A$4:$A$93, ROW()-ROW($C$19)+1 - ROWS('Ações gerais'!$A$4:$A$203))\n))","v":0},null,{"$f":"IF($F$18<>\"\",\n\"\",\nIF(OR($C168=\"\",$C168=0),\n   \"\",\n   IF(COUNTIF($C$19:C168,C168)=1,C168,\"\")\n))","v":""}]
[{"$f":"IF($F$18<>\"\",\n$F$18,\nIFERROR(\n   INDEX($E$19:$E$308,\n      _xlfn.AGGREGATE(15,6,\n         (ROW($E$19:$E$308)-ROW($E$19)+1)/($E$19:$E$308<>\"\"),\n         ROW()-ROW($A$19)+1\n      )\n   ),\n\"\"))","v":""},null,{"$f":"IF($F$18<>\"\",\n\"\",\nIF(ROW()-ROW($C$19)+1<=ROWS('Ações gerais'!$A$4:$A$203),\n   INDEX('Ações gerais'!$A$4:$A$203, ROW()-ROW($C$19)+1),\n   INDEX(Operacionalização!$A$4:$A$93, ROW()-ROW($C$19)+1 - ROWS('Ações gerais'!$A$4:$A$203))\n))","v":0},null,{"$f":"IF($F$18<>\"\",\n\"\",\nIF(OR($C169=\"\",$C169=0),\n   \"\",\n   IF(COUNTIF($C$19:C169,C169)=1,C169,\"\")\n))","v":""}]
[{"$f":"IF($F$18<>\"\",\n$F$18,\nIFERROR(\n   INDEX($E$19:$E$308,\n      _xlfn.AGGREGATE(15,6,\n         (ROW($E$19:$E$308)-ROW($E$19)+1)/($E$19:$E$308<>\"\"),\n         ROW()-ROW($A$19)+1\n      )\n   ),\n\"\"))","v":""},null,{"$f":"IF($F$18<>\"\",\n\"\",\nIF(ROW()-ROW($C$19)+1<=ROWS('Ações gerais'!$A$4:$A$203),\n   INDEX('Ações gerais'!$A$4:$A$203, ROW()-ROW($C$19)+1),\n   INDEX(Operacionalização!$A$4:$A$93, ROW()-ROW($C$19)+1 - ROWS('Ações gerais'!$A$4:$A$203))\n))","v":0},null,{"$f":"IF($F$18<>\"\",\n\"\",\nIF(OR($C170=\"\",$C170=0),\n   \"\",\n   IF(COUNTIF($C$19:C170,C170)=1,C170,\"\")\n))","v":""}]
[{"$f":"IF($F$18<>\"\",\n$F$18,\nIFERROR(\n   INDEX($E$19:$E$308,\n      _xlfn.AGGREGATE(15,6,\n         (ROW($E$19:$E$308)-ROW($E$19)+1)/($E$19:$E$308<>\"\"),\n         ROW()-ROW($A$19)+1\n      )\n   ),\n\"\"))","v":""},null,{"$f":"IF($F$18<>\"\",\n\"\",\nIF(ROW()-ROW($C$19)+1<=ROWS('Ações gerais'!$A$4:$A$203),\n   INDEX('Ações gerais'!$A$4:$A$203, ROW()-ROW($C$19)+1),\n   INDEX(Operacionalização!$A$4:$A$93, ROW()-ROW($C$19)+1 - ROWS('Ações gerais'!$A$4:$A$203))\n))","v":0},null,{"$f":"IF($F$18<>\"\",\n\"\",\nIF(OR($C171=\"\",$C171=0),\n   \"\",\n   IF(COUNTIF($C$19:C171,C171)=1,C171,\"\")\n))","v":""}]
[{"$f":"IF($F$18<>\"\",\n$F$18,\nIFERROR(\n   INDEX($E$19:$E$308,\n      _xlfn.AGGREGATE(15,6,\n         (ROW($E$19:$E$308)-ROW($E$19)+1)/($E$19:$E$308<>\"\"),\n         ROW()-ROW($A$19)+1\n      )\n   ),\n\"\"))","v":""},null,{"$f":"IF($F$18<>\"\",\n\"\",\nIF(ROW()-ROW($C$19)+1<=ROWS('Ações gerais'!$A$4:$A$203),\n   INDEX('Ações gerais'!$A$4:$A$203, ROW()-ROW($C$19)+1),\n   INDEX(Operacionalização!$A$4:$A$93, ROW()-ROW($C$19)+1 - ROWS('Ações gerais'!$A$4:$A$203))\n))","v":0},null,{"$f":"IF($F$18<>\"\",\n\"\",\nIF(OR($C172=\"\",$C172=0),\n   \"\",\n   IF(COUNTIF($C$19:C172,C172)=1,C172,\"\")\n))","v":""}]
[{"$f":"IF($F$18<>\"\",\n$F$18,\nIFERROR(\n   INDEX($E$19:$E$308,\n      _xlfn.AGGREGATE(15,6,\n         (ROW($E$19:$E$308)-ROW($E$19)+1)/($E$19:$E$308<>\"\"),\n         ROW()-ROW($A$19)+1\n      )\n   ),\n\"\"))","v":""},null,{"$f":"IF($F$18<>\"\",\n\"\",\nIF(ROW()-ROW($C$19)+1<=ROWS('Ações gerais'!$A$4:$A$203),\n   INDEX('Ações gerais'!$A$4:$A$203, ROW()-ROW($C$19)+1),\n   INDEX(Operacionalização!$A$4:$A$93, ROW()-ROW($C$19)+1 - ROWS('Ações gerais'!$A$4:$A$203))\n))","v":0},null,{"$f":"IF($F$18<>\"\",\n\"\",\nIF(OR($C173=\"\",$C173=0),\n   \"\",\n   IF(COUNTIF($C$19:C173,C173)=1,C173,\"\")\n))","v":""}]
[{"$f":"IF($F$18<>\"\",\n$F$18,\nIFERROR(\n   INDEX($E$19:$E$308,\n      _xlfn.AGGREGATE(15,6,\n         (ROW($E$19:$E$308)-ROW($E$19)+1)/($E$19:$E$308<>\"\"),\n         ROW()-ROW($A$19)+1\n      )\n   ),\n\"\"))","v":""},null,{"$f":"IF($F$18<>\"\",\n\"\",\nIF(ROW()-ROW($C$19)+1<=ROWS('Ações gerais'!$A$4:$A$203),\n   INDEX('Ações gerais'!$A$4:$A$203, ROW()-ROW($C$19)+1),\n   INDEX(Operacionalização!$A$4:$A$93, ROW()-ROW($C$19)+1 - ROWS('Ações gerais'!$A$4:$A$203))\n))","v":0},null,{"$f":"IF($F$18<>\"\",\n\"\",\nIF(OR($C174=\"\",$C174=0),\n   \"\",\n   IF(COUNTIF($C$19:C174,C174)=1,C174,\"\")\n))","v":""}]
[{"$f":"IF($F$18<>\"\",\n$F$18,\nIFERROR(\n   INDEX($E$19:$E$308,\n      _xlfn.AGGREGATE(15,6,\n         (ROW($E$19:$E$308)-ROW($E$19)+1)/($E$19:$E$308<>\"\"),\n         ROW()-ROW($A$19)+1\n      )\n   ),\n\"\"))","v":""},null,{"$f":"IF($F$18<>\"\",\n\"\",\nIF(ROW()-ROW($C$19)+1<=ROWS('Ações gerais'!$A$4:$A$203),\n   INDEX('Ações gerais'!$A$4:$A$203, ROW()-ROW($C$19)+1),\n   INDEX(Operacionalização!$A$4:$A$93, ROW()-ROW($C$19)+1 - ROWS('Ações gerais'!$A$4:$A$203))\n))","v":0},null,{"$f":"IF($F$18<>\"\",\n\"\",\nIF(OR($C175=\"\",$C175=0),\n   \"\",\n   IF(COUNTIF($C$19:C175,C175)=1,C175,\"\")\n))","v":""}]
[{"$f":"IF($F$18<>\"\",\n$F$18,\nIFERROR(\n   INDEX($E$19:$E$308,\n      _xlfn.AGGREGATE(15,6,\n         (ROW($E$19:$E$308)-ROW($E$19)+1)/($E$19:$E$308<>\"\"),\n         ROW()-ROW($A$19)+1\n      )\n   ),\n\"\"))","v":""},null,{"$f":"IF($F$18<>\"\",\n\"\",\nIF(ROW()-ROW($C$19)+1<=ROWS('Ações gerais'!$A$4:$A$203),\n   INDEX('Ações gerais'!$A$4:$A$203, ROW()-ROW($C$19)+1),\n   INDEX(Operacionalização!$A$4:$A$93, ROW()-ROW($C$19)+1 - ROWS('Ações gerais'!$A$4:$A$203))\n))","v":0},null,{"$f":"IF($F$18<>\"\",\n\"\",\nIF(OR($C176=\"\",$C176=0),\n   \"\",\n   IF(COUNTIF($C$19:C176,C176)=1,C176,\"\")\n))","v":""}]
[{"$f":"IF($F$18<>\"\",\n$F$18,\nIFERROR(\n   INDEX($E$19:$E$308,\n      _xlfn.AGGREGATE(15,6,\n         (ROW($E$19:$E$308)-ROW($E$19)+1)/($E$19:$E$308<>\"\"),\n         ROW()-ROW($A$19)+1\n      )\n   ),\n\"\"))","v":""},null,{"$f":"IF($F$18<>\"\",\n\"\",\nIF(ROW()-ROW($C$19)+1<=ROWS('Ações gerais'!$A$4:$A$203),\n   INDEX('Ações gerais'!$A$4:$A$203, ROW()-ROW($C$19)+1),\n   INDEX(Operacionalização!$A$4:$A$93, ROW()-ROW($C$19)+1 - ROWS('Ações gerais'!$A$4:$A$203))\n))","v":0},null,{"$f":"IF($F$18<>\"\",\n\"\",\nIF(OR($C177=\"\",$C177=0),\n   \"\",\n   IF(COUNTIF($C$19:C177,C177)=1,C177,\"\")\n))","v":""}]
[{"$f":"IF($F$18<>\"\",\n$F$18,\nIFERROR(\n   INDEX($E$19:$E$308,\n      _xlfn.AGGREGATE(15,6,\n         (ROW($E$19:$E$308)-ROW($E$19)+1)/($E$19:$E$308<>\"\"),\n         ROW()-ROW($A$19)+1\n      )\n   ),\n\"\"))","v":""},null,{"$f":"IF($F$18<>\"\",\n\"\",\nIF(ROW()-ROW($C$19)+1<=ROWS('Ações gerais'!$A$4:$A$203),\n   INDEX('Ações gerais'!$A$4:$A$203, ROW()-ROW($C$19)+1),\n   INDEX(Operacionalização!$A$4:$A$93, ROW()-ROW($C$19)+1 - ROWS('Ações gerais'!$A$4:$A$203))\n))","v":0},null,{"$f":"IF($F$18<>\"\",\n\"\",\nIF(OR($C178=\"\",$C178=0),\n   \"\",\n   IF(COUNTIF($C$19:C178,C178)=1,C178,\"\")\n))","v":""}]
[{"$f":"IF($F$18<>\"\",\n$F$18,\nIFERROR(\n   INDEX($E$19:$E$308,\n      _xlfn.AGGREGATE(15,6,\n         (ROW($E$19:$E$308)-ROW($E$19)+1)/($E$19:$E$308<>\"\"),\n         ROW()-ROW($A$19)+1\n      )\n   ),\n\"\"))","v":""},null,{"$f":"IF($F$18<>\"\",\n\"\",\nIF(ROW()-ROW($C$19)+1<=ROWS('Ações gerais'!$A$4:$A$203),\n   INDEX('Ações gerais'!$A$4:$A$203, ROW()-ROW($C$19)+1),\n   INDEX(Operacionalização!$A$4:$A$93, ROW()-ROW($C$19)+1 - ROWS('Ações gerais'!$A$4:$A$203))\n))","v":0},null,{"$f":"IF($F$18<>\"\",\n\"\",\nIF(OR($C179=\"\",$C179=0),\n   \"\",\n   IF(COUNTIF($C$19:C179,C179)=1,C179,\"\")\n))","v":""}]
[{"$f":"IF($F$18<>\"\",\n$F$18,\nIFERROR(\n   INDEX($E$19:$E$308,\n      _xlfn.AGGREGATE(15,6,\n         (ROW($E$19:$E$308)-ROW($E$19)+1)/($E$19:$E$308<>\"\"),\n         ROW()-ROW($A$19)+1\n      )\n   ),\n\"\"))","v":""},null,{"$f":"IF($F$18<>\"\",\n\"\",\nIF(ROW()-ROW($C$19)+1<=ROWS('Ações gerais'!$A$4:$A$203),\n   INDEX('Ações gerais'!$A$4:$A$203, ROW()-ROW($C$19)+1),\n   INDEX(Operacionalização!$A$4:$A$93, ROW()-ROW($C$19)+1 - ROWS('Ações gerais'!$A$4:$A$203))\n))","v":0},null,{"$f":"IF($F$18<>\"\",\n\"\",\nIF(OR($C180=\"\",$C180=0),\n   \"\",\n   IF(COUNTIF($C$19:C180,C180)=1,C180,\"\")\n))","v":""}]
[{"$f":"IF($F$18<>\"\",\n$F$18,\nIFERROR(\n   INDEX($E$19:$E$308,\n      _xlfn.AGGREGATE(15,6,\n         (ROW($E$19:$E$308)-ROW($E$19)+1)/($E$19:$E$308<>\"\"),\n         ROW()-ROW($A$19)+1\n      )\n   ),\n\"\"))","v":""},null,{"$f":"IF($F$18<>\"\",\n\"\",\nIF(ROW()-ROW($C$19)+1<=ROWS('Ações gerais'!$A$4:$A$203),\n   INDEX('Ações gerais'!$A$4:$A$203, ROW()-ROW($C$19)+1),\n   INDEX(Operacionalização!$A$4:$A$93, ROW()-ROW($C$19)+1 - ROWS('Ações gerais'!$A$4:$A$203))\n))","v":0},null,{"$f":"IF($F$18<>\"\",\n\"\",\nIF(OR($C181=\"\",$C181=0),\n   \"\",\n   IF(COUNTIF($C$19:C181,C181)=1,C181,\"\")\n))","v":""}]
[{"$f":"IF($F$18<>\"\",\n$F$18,\nIFERROR(\n   INDEX($E$19:$E$308,\n      _xlfn.AGGREGATE(15,6,\n         (ROW($E$19:$E$308)-ROW($E$19)+1)/($E$19:$E$308<>\"\"),\n         ROW()-ROW($A$19)+1\n      )\n   ),\n\"\"))","v":""},null,{"$f":"IF($F$18<>\"\",\n\"\",\nIF(ROW()-ROW($C$19)+1<=ROWS('Ações gerais'!$A$4:$A$203),\n   INDEX('Ações gerais'!$A$4:$A$203, ROW()-ROW($C$19)+1),\n   INDEX(Operacionalização!$A$4:$A$93, ROW()-ROW($C$19)+1 - ROWS('Ações gerais'!$A$4:$A$203))\n))","v":0},null,{"$f":"IF($F$18<>\"\",\n\"\",\nIF(OR($C182=\"\",$C182=0),\n   \"\",\n   IF(COUNTIF($C$19:C182,C182)=1,C182,\"\")\n))","v":""}]
[{"$f":"IF($F$18<>\"\",\n$F$18,\nIFERROR(\n   INDEX($E$19:$E$308,\n      _xlfn.AGGREGATE(15,6,\n         (ROW($E$19:$E$308)-ROW($E$19)+1)/($E$19:$E$308<>\"\"),\n         ROW()-ROW($A$19)+1\n      )\n   ),\n\"\"))","v":""},null,{"$f":"IF($F$18<>\"\",\n\"\",\nIF(ROW()-ROW($C$19)+1<=ROWS('Ações gerais'!$A$4:$A$203),\n   INDEX('Ações gerais'!$A$4:$A$203, ROW()-ROW($C$19)+1),\n   INDEX(Operacionalização!$A$4:$A$93, ROW()-ROW($C$19)+1 - ROWS('Ações gerais'!$A$4:$A$203))\n))","v":0},null,{"$f":"IF($F$18<>\"\",\n\"\",\nIF(OR($C183=\"\",$C183=0),\n   \"\",\n   IF(COUNTIF($C$19:C183,C183)=1,C183,\"\")\n))","v":""}]
[{"$f":"IF($F$18<>\"\",\n$F$18,\nIFERROR(\n   INDEX($E$19:$E$308,\n      _xlfn.AGGREGATE(15,6,\n         (ROW($E$19:$E$308)-ROW($E$19)+1)/($E$19:$E$308<>\"\"),\n         ROW()-ROW($A$19)+1\n      )\n   ),\n\"\"))","v":""},null,{"$f":"IF($F$18<>\"\",\n\"\",\nIF(ROW()-ROW($C$19)+1<=ROWS('Ações gerais'!$A$4:$A$203),\n   INDEX('Ações gerais'!$A$4:$A$203, ROW()-ROW($C$19)+1),\n   INDEX(Operacionalização!$A$4:$A$93, ROW()-ROW($C$19)+1 - ROWS('Ações gerais'!$A$4:$A$203))\n))","v":0},null,{"$f":"IF($F$18<>\"\",\n\"\",\nIF(OR($C184=\"\",$C184=0),\n   \"\",\n   IF(COUNTIF($C$19:C184,C184)=1,C184,\"\")\n))","v":""}]
[{"$f":"IF($F$18<>\"\",\n$F$18,\nIFERROR(\n   INDEX($E$19:$E$308,\n      _xlfn.AGGREGATE(15,6,\n         (ROW($E$19:$E$308)-ROW($E$19)+1)/($E$19:$E$308<>\"\"),\n         ROW()-ROW($A$19)+1\n      )\n   ),\n\"\"))","v":""},null,{"$f":"IF($F$18<>\"\",\n\"\",\nIF(ROW()-ROW($C$19)+1<=ROWS('Ações gerais'!$A$4:$A$203),\n   INDEX('Ações gerais'!$A$4:$A$203, ROW()-ROW($C$19)+1),\n   INDEX(Operacionalização!$A$4:$A$93, ROW()-ROW($C$19)+1 - ROWS('Ações gerais'!$A$4:$A$203))\n))","v":0},null,{"$f":"IF($F$18<>\"\",\n\"\",\nIF(OR($C185=\"\",$C185=0),\n   \"\",\n   IF(COUNTIF($C$19:C185,C185)=1,C185,\"\")\n))","v":""}]
[{"$f":"IF($F$18<>\"\",\n$F$18,\nIFERROR(\n   INDEX($E$19:$E$308,\n      _xlfn.AGGREGATE(15,6,\n         (ROW($E$19:$E$308)-ROW($E$19)+1)/($E$19:$E$308<>\"\"),\n         ROW()-ROW($A$19)+1\n      )\n   ),\n\"\"))","v":""},null,{"$f":"IF($F$18<>\"\",\n\"\",\nIF(ROW()-ROW($C$19)+1<=ROWS('Ações gerais'!$A$4:$A$203),\n   INDEX('Ações gerais'!$A$4:$A$203, ROW()-ROW($C$19)+1),\n   INDEX(Operacionalização!$A$4:$A$93, ROW()-ROW($C$19)+1 - ROWS('Ações gerais'!$A$4:$A$203))\n))","v":0},null,{"$f":"IF($F$18<>\"\",\n\"\",\nIF(OR($C186=\"\",$C186=0),\n   \"\",\n   IF(COUNTIF($C$19:C186,C186)=1,C186,\"\")\n))","v":""}]
[{"$f":"IF($F$18<>\"\",\n$F$18,\nIFERROR(\n   INDEX($E$19:$E$308,\n      _xlfn.AGGREGATE(15,6,\n         (ROW($E$19:$E$308)-ROW($E$19)+1)/($E$19:$E$308<>\"\"),\n         ROW()-ROW($A$19)+1\n      )\n   ),\n\"\"))","v":""},null,{"$f":"IF($F$18<>\"\",\n\"\",\nIF(ROW()-ROW($C$19)+1<=ROWS('Ações gerais'!$A$4:$A$203),\n   INDEX('Ações gerais'!$A$4:$A$203, ROW()-ROW($C$19)+1),\n   INDEX(Operacionalização!$A$4:$A$93, ROW()-ROW($C$19)+1 - ROWS('Ações gerais'!$A$4:$A$203))\n))","v":0},null,{"$f":"IF($F$18<>\"\",\n\"\",\nIF(OR($C187=\"\",$C187=0),\n   \"\",\n   IF(COUNTIF($C$19:C187,C187)=1,C187,\"\")\n))","v":""}]
[{"$f":"IF($F$18<>\"\",\n$F$18,\nIFERROR(\n   INDEX($E$19:$E$308,\n      _xlfn.AGGREGATE(15,6,\n         (ROW($E$19:$E$308)-ROW($E$19)+1)/($E$19:$E$308<>\"\"),\n         ROW()-ROW($A$19)+1\n      )\n   ),\n\"\"))","v":""},null,{"$f":"IF($F$18<>\"\",\n\"\",\nIF(ROW()-ROW($C$19)+1<=ROWS('Ações gerais'!$A$4:$A$203),\n   INDEX('Ações gerais'!$A$4:$A$203, ROW()-ROW($C$19)+1),\n   INDEX(Operacionalização!$A$4:$A$93, ROW()-ROW($C$19)+1 - ROWS('Ações gerais'!$A$4:$A$203))\n))","v":0},null,{"$f":"IF($F$18<>\"\",\n\"\",\nIF(OR($C188=\"\",$C188=0),\n   \"\",\n   IF(COUNTIF($C$19:C188,C188)=1,C188,\"\")\n))","v":""}]
[{"$f":"IF($F$18<>\"\",\n$F$18,\nIFERROR(\n   INDEX($E$19:$E$308,\n      _xlfn.AGGREGATE(15,6,\n         (ROW($E$19:$E$308)-ROW($E$19)+1)/($E$19:$E$308<>\"\"),\n         ROW()-ROW($A$19)+1\n      )\n   ),\n\"\"))","v":""},null,{"$f":"IF($F$18<>\"\",\n\"\",\nIF(ROW()-ROW($C$19)+1<=ROWS('Ações gerais'!$A$4:$A$203),\n   INDEX('Ações gerais'!$A$4:$A$203, ROW()-ROW($C$19)+1),\n   INDEX(Operacionalização!$A$4:$A$93, ROW()-ROW($C$19)+1 - ROWS('Ações gerais'!$A$4:$A$203))\n))","v":0},null,{"$f":"IF($F$18<>\"\",\n\"\",\nIF(OR($C189=\"\",$C189=0),\n   \"\",\n   IF(COUNTIF($C$19:C189,C189)=1,C189,\"\")\n))","v":""}]
[{"$f":"IF($F$18<>\"\",\n$F$18,\nIFERROR(\n   INDEX($E$19:$E$308,\n      _xlfn.AGGREGATE(15,6,\n         (ROW($E$19:$E$308)-ROW($E$19)+1)/($E$19:$E$308<>\"\"),\n         ROW()-ROW($A$19)+1\n      )\n   ),\n\"\"))","v":""},null,{"$f":"IF($F$18<>\"\",\n\"\",\nIF(ROW()-ROW($C$19)+1<=ROWS('Ações gerais'!$A$4:$A$203),\n   INDEX('Ações gerais'!$A$4:$A$203, ROW()-ROW($C$19)+1),\n   INDEX(Operacionalização!$A$4:$A$93, ROW()-ROW($C$19)+1 - ROWS('Ações gerais'!$A$4:$A$203))\n))","v":0},null,{"$f":"IF($F$18<>\"\",\n\"\",\nIF(OR($C190=\"\",$C190=0),\n   \"\",\n   IF(COUNTIF($C$19:C190,C190)=1,C190,\"\")\n))","v":""}]
[{"$f":"IF($F$18<>\"\",\n$F$18,\nIFERROR(\n   INDEX($E$19:$E$308,\n      _xlfn.AGGREGATE(15,6,\n         (ROW($E$19:$E$308)-ROW($E$19)+1)/($E$19:$E$308<>\"\"),\n         ROW()-ROW($A$19)+1\n      )\n   ),\n\"\"))","v":""},null,{"$f":"IF($F$18<>\"\",\n\"\",\nIF(ROW()-ROW($C$19)+1<=ROWS('Ações gerais'!$A$4:$A$203),\n   INDEX('Ações gerais'!$A$4:$A$203, ROW()-ROW($C$19)+1),\n   INDEX(Operacionalização!$A$4:$A$93, ROW()-ROW($C$19)+1 - ROWS('Ações gerais'!$A$4:$A$203))\n))","v":0},null,{"$f":"IF($F$18<>\"\",\n\"\",\nIF(OR($C191=\"\",$C191=0),\n   \"\",\n   IF(COUNTIF($C$19:C191,C191)=1,C191,\"\")\n))","v":""}]
[{"$f":"IF($F$18<>\"\",\n$F$18,\nIFERROR(\n   INDEX($E$19:$E$308,\n      _xlfn.AGGREGATE(15,6,\n         (ROW($E$19:$E$308)-ROW($E$19)+1)/($E$19:$E$308<>\"\"),\n         ROW()-ROW($A$19)+1\n      )\n   ),\n\"\"))","v":""},null,{"$f":"IF($F$18<>\"\",\n\"\",\nIF(ROW()-ROW($C$19)+1<=ROWS('Ações gerais'!$A$4:$A$203),\n   INDEX('Ações gerais'!$A$4:$A$203, ROW()-ROW($C$19)+1),\n   INDEX(Operacionalização!$A$4:$A$93, ROW()-ROW($C$19)+1 - ROWS('Ações gerais'!$A$4:$A$203))\n))","v":0},null,{"$f":"IF($F$18<>\"\",\n\"\",\nIF(OR($C192=\"\",$C192=0),\n   \"\",\n   IF(COUNTIF($C$19:C192,C192)=1,C192,\"\")\n))","v":""}]
[{"$f":"IF($F$18<>\"\",\n$F$18,\nIFERROR(\n   INDEX($E$19:$E$308,\n      _xlfn.AGGREGATE(15,6,\n         (ROW($E$19:$E$308)-ROW($E$19)+1)/($E$19:$E$308<>\"\"),\n         ROW()-ROW($A$19)+1\n      )\n   ),\n\"\"))","v":""},null,{"$f":"IF($F$18<>\"\",\n\"\",\nIF(ROW()-ROW($C$19)+1<=ROWS('Ações gerais'!$A$4:$A$203),\n   INDEX('Ações gerais'!$A$4:$A$203, ROW()-ROW($C$19)+1),\n   INDEX(Operacionalização!$A$4:$A$93, ROW()-ROW($C$19)+1 - ROWS('Ações gerais'!$A$4:$A$203))\n))","v":0},null,{"$f":"IF($F$18<>\"\",\n\"\",\nIF(OR($C193=\"\",$C193=0),\n   \"\",\n   IF(COUNTIF($C$19:C193,C193)=1,C193,\"\")\n))","v":""}]
[{"$f":"IF($F$18<>\"\",\n$F$18,\nIFERROR(\n   INDEX($E$19:$E$308,\n      _xlfn.AGGREGATE(15,6,\n         (ROW($E$19:$E$308)-ROW($E$19)+1)/($E$19:$E$308<>\"\"),\n         ROW()-ROW($A$19)+1\n      )\n   ),\n\"\"))","v":""},null,{"$f":"IF($F$18<>\"\",\n\"\",\nIF(ROW()-ROW($C$19)+1<=ROWS('Ações gerais'!$A$4:$A$203),\n   INDEX('Ações gerais'!$A$4:$A$203, ROW()-ROW($C$19)+1),\n   INDEX(Operacionalização!$A$4:$A$93, ROW()-ROW($C$19)+1 - ROWS('Ações gerais'!$A$4:$A$203))\n))","v":0},null,{"$f":"IF($F$18<>\"\",\n\"\",\nIF(OR($C194=\"\",$C194=0),\n   \"\",\n   IF(COUNTIF($C$19:C194,C194)=1,C194,\"\")\n))","v":""}]
[{"$f":"IF($F$18<>\"\",\n$F$18,\nIFERROR(\n   INDEX($E$19:$E$308,\n      _xlfn.AGGREGATE(15,6,\n         (ROW($E$19:$E$308)-ROW($E$19)+1)/($E$19:$E$308<>\"\"),\n         ROW()-ROW($A$19)+1\n      )\n   ),\n\"\"))","v":""},null,{"$f":"IF($F$18<>\"\",\n\"\",\nIF(ROW()-ROW($C$19)+1<=ROWS('Ações gerais'!$A$4:$A$203),\n   INDEX('Ações gerais'!$A$4:$A$203, ROW()-ROW($C$19)+1),\n   INDEX(Operacionalização!$A$4:$A$93, ROW()-ROW($C$19)+1 - ROWS('Ações gerais'!$A$4:$A$203))\n))","v":0},null,{"$f":"IF($F$18<>\"\",\n\"\",\nIF(OR($C195=\"\",$C195=0),\n   \"\",\n   IF(COUNTIF($C$19:C195,C195)=1,C195,\"\")\n))","v":""}]
[{"$f":"IF($F$18<>\"\",\n$F$18,\nIFERROR(\n   INDEX($E$19:$E$308,\n      _xlfn.AGGREGATE(15,6,\n         (ROW($E$19:$E$308)-ROW($E$19)+1)/($E$19:$E$308<>\"\"),\n         ROW()-ROW($A$19)+1\n      )\n   ),\n\"\"))","v":""},null,{"$f":"IF($F$18<>\"\",\n\"\",\nIF(ROW()-ROW($C$19)+1<=ROWS('Ações gerais'!$A$4:$A$203),\n   INDEX('Ações gerais'!$A$4:$A$203, ROW()-ROW($C$19)+1),\n   INDEX(Operacionalização!$A$4:$A$93, ROW()-ROW($C$19)+1 - ROWS('Ações gerais'!$A$4:$A$203))\n))","v":0},null,{"$f":"IF($F$18<>\"\",\n\"\",\nIF(OR($C196=\"\",$C196=0),\n   \"\",\n   IF(COUNTIF($C$19:C196,C196)=1,C196,\"\")\n))","v":""}]
[{"$f":"IF($F$18<>\"\",\n$F$18,\nIFERROR(\n   INDEX($E$19:$E$308,\n      _xlfn.AGGREGATE(15,6,\n         (ROW($E$19:$E$308)-ROW($E$19)+1)/($E$19:$E$308<>\"\"),\n         ROW()-ROW($A$19)+1\n      )\n   ),\n\"\"))","v":""},null,{"$f":"IF($F$18<>\"\",\n\"\",\nIF(ROW()-ROW($C$19)+1<=ROWS('Ações gerais'!$A$4:$A$203),\n   INDEX('Ações gerais'!$A$4:$A$203, ROW()-ROW($C$19)+1),\n   INDEX(Operacionalização!$A$4:$A$93, ROW()-ROW($C$19)+1 - ROWS('Ações gerais'!$A$4:$A$203))\n))","v":0},null,{"$f":"IF($F$18<>\"\",\n\"\",\nIF(OR($C197=\"\",$C197=0),\n   \"\",\n   IF(COUNTIF($C$19:C197,C197)=1,C197,\"\")\n))","v":""}]
[{"$f":"IF($F$18<>\"\",\n$F$18,\nIFERROR(\n   INDEX($E$19:$E$308,\n      _xlfn.AGGREGATE(15,6,\n         (ROW($E$19:$E$308)-ROW($E$19)+1)/($E$19:$E$308<>\"\"),\n         ROW()-ROW($A$19)+1\n      )\n   ),\n\"\"))","v":""},null,{"$f":"IF($F$18<>\"\",\n\"\",\nIF(ROW()-ROW($C$19)+1<=ROWS('Ações gerais'!$A$4:$A$203),\n   INDEX('Ações gerais'!$A$4:$A$203, ROW()-ROW($C$19)+1),\n   INDEX(Operacionalização!$A$4:$A$93, ROW()-ROW($C$19)+1 - ROWS('Ações gerais'!$A$4:$A$203))\n))","v":0},null,{"$f":"IF($F$18<>\"\",\n\"\",\nIF(OR($C198=\"\",$C198=0),\n   \"\",\n   IF(COUNTIF($C$19:C198,C198)=1,C198,\"\")\n))","v":""}]
[{"$f":"IF($F$18<>\"\",\n$F$18,\nIFERROR(\n   INDEX($E$19:$E$308,\n      _xlfn.AGGREGATE(15,6,\n         (ROW($E$19:$E$308)-ROW($E$19)+1)/($E$19:$E$308<>\"\"),\n         ROW()-ROW($A$19)+1\n      )\n   ),\n\"\"))","v":""},null,{"$f":"IF($F$18<>\"\",\n\"\",\nIF(ROW()-ROW($C$19)+1<=ROWS('Ações gerais'!$A$4:$A$203),\n   INDEX('Ações gerais'!$A$4:$A$203, ROW()-ROW($C$19)+1),\n   INDEX(Operacionalização!$A$4:$A$93, ROW()-ROW($C$19)+1 - ROWS('Ações gerais'!$A$4:$A$203))\n))","v":0},null,{"$f":"IF($F$18<>\"\",\n\"\",\nIF(OR($C199=\"\",$C199=0),\n   \"\",\n   IF(COUNTIF($C$19:C199,C199)=1,C199,\"\")\n))","v":""}]
[{"$f":"IF($F$18<>\"\",\n$F$18,\nIFERROR(\n   INDEX($E$19:$E$308,\n      _xlfn.AGGREGATE(15,6,\n         (ROW($E$19:$E$308)-ROW($E$19)+1)/($E$19:$E$308<>\"\"),\n         ROW()-ROW($A$19)+1\n      )\n   ),\n\"\"))","v":""},null,{"$f":"IF($F$18<>\"\",\n\"\",\nIF(ROW()-ROW($C$19)+1<=ROWS('Ações gerais'!$A$4:$A$203),\n   INDEX('Ações gerais'!$A$4:$A$203, ROW()-ROW($C$19)+1),\n   INDEX(Operacionalização!$A$4:$A$93, ROW()-ROW($C$19)+1 - ROWS('Ações gerais'!$A$4:$A$203))\n))","v":0},null,{"$f":"IF($F$18<>\"\",\n\"\",\nIF(OR($C200=\"\",$C200=0),\n   \"\",\n   IF(COUNTIF($C$19:C200,C200)=1,C200,\"\")\n))","v":""}]
[{"$f":"IF($F$18<>\"\",\n$F$18,\nIFERROR(\n   INDEX($E$19:$E$308,\n      _xlfn.AGGREGATE(15,6,\n         (ROW($E$19:$E$308)-ROW($E$19)+1)/($E$19:$E$308<>\"\"),\n         ROW()-ROW($A$19)+1\n      )\n   ),\n\"\"))","v":""},null,{"$f":"IF($F$18<>\"\",\n\"\",\nIF(ROW()-ROW($C$19)+1<=ROWS('Ações gerais'!$A$4:$A$203),\n   INDEX('Ações gerais'!$A$4:$A$203, ROW()-ROW($C$19)+1),\n   INDEX(Operacionalização!$A$4:$A$93, ROW()-ROW($C$19)+1 - ROWS('Ações gerais'!$A$4:$A$203))\n))","v":0},null,{"$f":"IF($F$18<>\"\",\n\"\",\nIF(OR($C201=\"\",$C201=0),\n   \"\",\n   IF(COUNTIF($C$19:C201,C201)=1,C201,\"\")\n))","v":""}]
[{"$f":"IF($F$18<>\"\",\n$F$18,\nIFERROR(\n   INDEX($E$19:$E$308,\n      _xlfn.AGGREGATE(15,6,\n         (ROW($E$19:$E$308)-ROW($E$19)+1)/($E$19:$E$308<>\"\"),\n         ROW()-ROW($A$19)+1\n      )\n   ),\n\"\"))","v":""},null,{"$f":"IF($F$18<>\"\",\n\"\",\nIF(ROW()-ROW($C$19)+1<=ROWS('Ações gerais'!$A$4:$A$203),\n   INDEX('Ações gerais'!$A$4:$A$203, ROW()-ROW($C$19)+1),\n   INDEX(Operacionalização!$A$4:$A$93, ROW()-ROW($C$19)+1 - ROWS('Ações gerais'!$A$4:$A$203))\n))","v":0},null,{"$f":"IF($F$18<>\"\",\n\"\",\nIF(OR($C202=\"\",$C202=0),\n   \"\",\n   IF(COUNTIF($C$19:C202,C202)=1,C202,\"\")\n))","v":""}]
[{"$f":"IF($F$18<>\"\",\n$F$18,\nIFERROR(\n   INDEX($E$19:$E$308,\n      _xlfn.AGGREGATE(15,6,\n         (ROW($E$19:$E$308)-ROW($E$19)+1)/($E$19:$E$308<>\"\"),\n         ROW()-ROW($A$19)+1\n      )\n   ),\n\"\"))","v":""},null,{"$f":"IF($F$18<>\"\",\n\"\",\nIF(ROW()-ROW($C$19)+1<=ROWS('Ações gerais'!$A$4:$A$203),\n   INDEX('Ações gerais'!$A$4:$A$203, ROW()-ROW($C$19)+1),\n   INDEX(Operacionalização!$A$4:$A$93, ROW()-ROW($C$19)+1 - ROWS('Ações gerais'!$A$4:$A$203))\n))","v":0},null,{"$f":"IF($F$18<>\"\",\n\"\",\nIF(OR($C203=\"\",$C203=0),\n   \"\",\n   IF(COUNTIF($C$19:C203,C203)=1,C203,\"\")\n))","v":""}]
[{"$f":"IF($F$18<>\"\",\n$F$18,\nIFERROR(\n   INDEX($E$19:$E$308,\n      _xlfn.AGGREGATE(15,6,\n         (ROW($E$19:$E$308)-ROW($E$19)+1)/($E$19:$E$308<>\"\"),\n         ROW()-ROW($A$19)+1\n      )\n   ),\n\"\"))","v":""},null,{"$f":"IF($F$18<>\"\",\n\"\",\nIF(ROW()-ROW($C$19)+1<=ROWS('Ações gerais'!$A$4:$A$203),\n   INDEX('Ações gerais'!$A$4:$A$203, ROW()-ROW($C$19)+1),\n   INDEX(Operacionalização!$A$4:$A$93, ROW()-ROW($C$19)+1 - ROWS('Ações gerais'!$A$4:$A$203))\n))","v":0},null,{"$f":"IF($F$18<>\"\",\n\"\",\nIF(OR($C204=\"\",$C204=0),\n   \"\",\n   IF(COUNTIF($C$19:C204,C204)=1,C204,\"\")\n))","v":""}]
[{"$f":"IF($F$18<>\"\",\n$F$18,\nIFERROR(\n   INDEX($E$19:$E$308,\n      _xlfn.AGGREGATE(15,6,\n         (ROW($E$19:$E$308)-ROW($E$19)+1)/($E$19:$E$308<>\"\"),\n         ROW()-ROW($A$19)+1\n      )\n   ),\n\"\"))","v":""},null,{"$f":"IF($F$18<>\"\",\n\"\",\nIF(ROW()-ROW($C$19)+1<=ROWS('Ações gerais'!$A$4:$A$203),\n   INDEX('Ações gerais'!$A$4:$A$203, ROW()-ROW($C$19)+1),\n   INDEX(Operacionalização!$A$4:$A$93, ROW()-ROW($C$19)+1 - ROWS('Ações gerais'!$A$4:$A$203))\n))","v":0},null,{"$f":"IF($F$18<>\"\",\n\"\",\nIF(OR($C205=\"\",$C205=0),\n   \"\",\n   IF(COUNTIF($C$19:C205,C205)=1,C205,\"\")\n))","v":""}]
[{"$f":"IF($F$18<>\"\",\n$F$18,\nIFERROR(\n   INDEX($E$19:$E$308,\n      _xlfn.AGGREGATE(15,6,\n         (ROW($E$19:$E$308)-ROW($E$19)+1)/($E$19:$E$308<>\"\"),\n         ROW()-ROW($A$19)+1\n      )\n   ),\n\"\"))","v":""},null,{"$f":"IF($F$18<>\"\",\n\"\",\nIF(ROW()-ROW($C$19)+1<=ROWS('Ações gerais'!$A$4:$A$203),\n   INDEX('Ações gerais'!$A$4:$A$203, ROW()-ROW($C$19)+1),\n   INDEX(Operacionalização!$A$4:$A$93, ROW()-ROW($C$19)+1 - ROWS('Ações gerais'!$A$4:$A$203))\n))","v":0},null,{"$f":"IF($F$18<>\"\",\n\"\",\nIF(OR($C206=\"\",$C206=0),\n   \"\",\n   IF(COUNTIF($C$19:C206,C206)=1,C206,\"\")\n))","v":""}]
[{"$f":"IF($F$18<>\"\",\n$F$18,\nIFERROR(\n   INDEX($E$19:$E$308,\n      _xlfn.AGGREGATE(15,6,\n         (ROW($E$19:$E$308)-ROW($E$19)+1)/($E$19:$E$308<>\"\"),\n         ROW()-ROW($A$19)+1\n      )\n   ),\n\"\"))","v":""},null,{"$f":"IF($F$18<>\"\",\n\"\",\nIF(ROW()-ROW($C$19)+1<=ROWS('Ações gerais'!$A$4:$A$203),\n   INDEX('Ações gerais'!$A$4:$A$203, ROW()-ROW($C$19)+1),\n   INDEX(Operacionalização!$A$4:$A$93, ROW()-ROW($C$19)+1 - ROWS('Ações gerais'!$A$4:$A$203))\n))","v":0},null,{"$f":"IF($F$18<>\"\",\n\"\",\nIF(OR($C207=\"\",$C207=0),\n   \"\",\n   IF(COUNTIF($C$19:C207,C207)=1,C207,\"\")\n))","v":""}]
[{"$f":"IF($F$18<>\"\",\n$F$18,\nIFERROR(\n   INDEX($E$19:$E$308,\n      _xlfn.AGGREGATE(15,6,\n         (ROW($E$19:$E$308)-ROW($E$19)+1)/($E$19:$E$308<>\"\"),\n         ROW()-ROW($A$19)+1\n      )\n   ),\n\"\"))","v":""},null,{"$f":"IF($F$18<>\"\",\n\"\",\nIF(ROW()-ROW($C$19)+1<=ROWS('Ações gerais'!$A$4:$A$203),\n   INDEX('Ações gerais'!$A$4:$A$203, ROW()-ROW($C$19)+1),\n   INDEX(Operacionalização!$A$4:$A$93, ROW()-ROW($C$19)+1 - ROWS('Ações gerais'!$A$4:$A$203))\n))","v":0},null,{"$f":"IF($F$18<>\"\",\n\"\",\nIF(OR($C208=\"\",$C208=0),\n   \"\",\n   IF(COUNTIF($C$19:C208,C208)=1,C208,\"\")\n))","v":""}]
[{"$f":"IF($F$18<>\"\",\n$F$18,\nIFERROR(\n   INDEX($E$19:$E$308,\n      _xlfn.AGGREGATE(15,6,\n         (ROW($E$19:$E$308)-ROW($E$19)+1)/($E$19:$E$308<>\"\"),\n         ROW()-ROW($A$19)+1\n      )\n   ),\n\"\"))","v":""},null,{"$f":"IF($F$18<>\"\",\n\"\",\nIF(ROW()-ROW($C$19)+1<=ROWS('Ações gerais'!$A$4:$A$203),\n   INDEX('Ações gerais'!$A$4:$A$203, ROW()-ROW($C$19)+1),\n   INDEX(Operacionalização!$A$4:$A$93, ROW()-ROW($C$19)+1 - ROWS('Ações gerais'!$A$4:$A$203))\n))","v":0},null,{"$f":"IF($F$18<>\"\",\n\"\",\nIF(OR($C209=\"\",$C209=0),\n   \"\",\n   IF(COUNTIF($C$19:C209,C209)=1,C209,\"\")\n))","v":""}]
[{"$f":"IF($F$18<>\"\",\n$F$18,\nIFERROR(\n   INDEX($E$19:$E$308,\n      _xlfn.AGGREGATE(15,6,\n         (ROW($E$19:$E$308)-ROW($E$19)+1)/($E$19:$E$308<>\"\"),\n         ROW()-ROW($A$19)+1\n      )\n   ),\n\"\"))","v":""},null,{"$f":"IF($F$18<>\"\",\n\"\",\nIF(ROW()-ROW($C$19)+1<=ROWS('Ações gerais'!$A$4:$A$203),\n   INDEX('Ações gerais'!$A$4:$A$203, ROW()-ROW($C$19)+1),\n   INDEX(Operacionalização!$A$4:$A$93, ROW()-ROW($C$19)+1 - ROWS('Ações gerais'!$A$4:$A$203))\n))","v":0},null,{"$f":"IF($F$18<>\"\",\n\"\",\nIF(OR($C210=\"\",$C210=0),\n   \"\",\n   IF(COUNTIF($C$19:C210,C210)=1,C210,\"\")\n))","v":""}]
[{"$f":"IF($F$18<>\"\",\n$F$18,\nIFERROR(\n   INDEX($E$19:$E$308,\n      _xlfn.AGGREGATE(15,6,\n         (ROW($E$19:$E$308)-ROW($E$19)+1)/($E$19:$E$308<>\"\"),\n         ROW()-ROW($A$19)+1\n      )\n   ),\n\"\"))","v":""},null,{"$f":"IF($F$18<>\"\",\n\"\",\nIF(ROW()-ROW($C$19)+1<=ROWS('Ações gerais'!$A$4:$A$203),\n   INDEX('Ações gerais'!$A$4:$A$203, ROW()-ROW($C$19)+1),\n   INDEX(Operacionalização!$A$4:$A$93, ROW()-ROW($C$19)+1 - ROWS('Ações gerais'!$A$4:$A$203))\n))","v":0},null,{"$f":"IF($F$18<>\"\",\n\"\",\nIF(OR($C211=\"\",$C211=0),\n   \"\",\n   IF(COUNTIF($C$19:C211,C211)=1,C211,\"\")\n))","v":""}]
[{"$f":"IF($F$18<>\"\",\n$F$18,\nIFERROR(\n   INDEX($E$19:$E$308,\n      _xlfn.AGGREGATE(15,6,\n         (ROW($E$19:$E$308)-ROW($E$19)+1)/($E$19:$E$308<>\"\"),\n         ROW()-ROW($A$19)+1\n      )\n   ),\n\"\"))","v":""},null,{"$f":"IF($F$18<>\"\",\n\"\",\nIF(ROW()-ROW($C$19)+1<=ROWS('Ações gerais'!$A$4:$A$203),\n   INDEX('Ações gerais'!$A$4:$A$203, ROW()-ROW($C$19)+1),\n   INDEX(Operacionalização!$A$4:$A$93, ROW()-ROW($C$19)+1 - ROWS('Ações gerais'!$A$4:$A$203))\n))","v":0},null,{"$f":"IF($F$18<>\"\",\n\"\",\nIF(OR($C212=\"\",$C212=0),\n   \"\",\n   IF(COUNTIF($C$19:C212,C212)=1,C212,\"\")\n))","v":""}]
[{"$f":"IF($F$18<>\"\",\n$F$18,\nIFERROR(\n   INDEX($E$19:$E$308,\n      _xlfn.AGGREGATE(15,6,\n         (ROW($E$19:$E$308)-ROW($E$19)+1)/($E$19:$E$308<>\"\"),\n         ROW()-ROW($A$19)+1\n      )\n   ),\n\"\"))","v":""},null,{"$f":"IF($F$18<>\"\",\n\"\",\nIF(ROW()-ROW($C$19)+1<=ROWS('Ações gerais'!$A$4:$A$203),\n   INDEX('Ações gerais'!$A$4:$A$203, ROW()-ROW($C$19)+1),\n   INDEX(Operacionalização!$A$4:$A$93, ROW()-ROW($C$19)+1 - ROWS('Ações gerais'!$A$4:$A$203))\n))","v":0},null,{"$f":"IF($F$18<>\"\",\n\"\",\nIF(OR($C213=\"\",$C213=0),\n   \"\",\n   IF(COUNTIF($C$19:C213,C213)=1,C213,\"\")\n))","v":""}]
[{"$f":"IF($F$18<>\"\",\n$F$18,\nIFERROR(\n   INDEX($E$19:$E$308,\n      _xlfn.AGGREGATE(15,6,\n         (ROW($E$19:$E$308)-ROW($E$19)+1)/($E$19:$E$308<>\"\"),\n         ROW()-ROW($A$19)+1\n      )\n   ),\n\"\"))","v":""},null,{"$f":"IF($F$18<>\"\",\n\"\",\nIF(ROW()-ROW($C$19)+1<=ROWS('Ações gerais'!$A$4:$A$203),\n   INDEX('Ações gerais'!$A$4:$A$203, ROW()-ROW($C$19)+1),\n   INDEX(Operacionalização!$A$4:$A$93, ROW()-ROW($C$19)+1 - ROWS('Ações gerais'!$A$4:$A$203))\n))","v":0},null,{"$f":"IF($F$18<>\"\",\n\"\",\nIF(OR($C214=\"\",$C214=0),\n   \"\",\n   IF(COUNTIF($C$19:C214,C214)=1,C214,\"\")\n))","v":""}]
[{"$f":"IF($F$18<>\"\",\n$F$18,\nIFERROR(\n   INDEX($E$19:$E$308,\n      _xlfn.AGGREGATE(15,6,\n         (ROW($E$19:$E$308)-ROW($E$19)+1)/($E$19:$E$308<>\"\"),\n         ROW()-ROW($A$19)+1\n      )\n   ),\n\"\"))","v":""},null,{"$f":"IF($F$18<>\"\",\n\"\",\nIF(ROW()-ROW($C$19)+1<=ROWS('Ações gerais'!$A$4:$A$203),\n   INDEX('Ações gerais'!$A$4:$A$203, ROW()-ROW($C$19)+1),\n   INDEX(Operacionalização!$A$4:$A$93, ROW()-ROW($C$19)+1 - ROWS('Ações gerais'!$A$4:$A$203))\n))","v":0},null,{"$f":"IF($F$18<>\"\",\n\"\",\nIF(OR($C215=\"\",$C215=0),\n   \"\",\n   IF(COUNTIF($C$19:C215,C215)=1,C215,\"\")\n))","v":""}]
[{"$f":"IF($F$18<>\"\",\n$F$18,\nIFERROR(\n   INDEX($E$19:$E$308,\n      _xlfn.AGGREGATE(15,6,\n         (ROW($E$19:$E$308)-ROW($E$19)+1)/($E$19:$E$308<>\"\"),\n         ROW()-ROW($A$19)+1\n      )\n   ),\n\"\"))","v":""},null,{"$f":"IF($F$18<>\"\",\n\"\",\nIF(ROW()-ROW($C$19)+1<=ROWS('Ações gerais'!$A$4:$A$203),\n   INDEX('Ações gerais'!$A$4:$A$203, ROW()-ROW($C$19)+1),\n   INDEX(Operacionalização!$A$4:$A$93, ROW()-ROW($C$19)+1 - ROWS('Ações gerais'!$A$4:$A$203))\n))","v":0},null,{"$f":"IF($F$18<>\"\",\n\"\",\nIF(OR($C216=\"\",$C216=0),\n   \"\",\n   IF(COUNTIF($C$19:C216,C216)=1,C216,\"\")\n))","v":""}]
[{"$f":"IF($F$18<>\"\",\n$F$18,\nIFERROR(\n   INDEX($E$19:$E$308,\n      _xlfn.AGGREGATE(15,6,\n         (ROW($E$19:$E$308)-ROW($E$19)+1)/($E$19:$E$308<>\"\"),\n         ROW()-ROW($A$19)+1\n      )\n   ),\n\"\"))","v":""},null,{"$f":"IF($F$18<>\"\",\n\"\",\nIF(ROW()-ROW($C$19)+1<=ROWS('Ações gerais'!$A$4:$A$203),\n   INDEX('Ações gerais'!$A$4:$A$203, ROW()-ROW($C$19)+1),\n   INDEX(Operacionalização!$A$4:$A$93, ROW()-ROW($C$19)+1 - ROWS('Ações gerais'!$A$4:$A$203))\n))","v":0},null,{"$f":"IF($F$18<>\"\",\n\"\",\nIF(OR($C217=\"\",$C217=0),\n   \"\",\n   IF(COUNTIF($C$19:C217,C217)=1,C217,\"\")\n))","v":""}]
[{"$f":"IF($F$18<>\"\",\n$F$18,\nIFERROR(\n   INDEX($E$19:$E$308,\n      _xlfn.AGGREGATE(15,6,\n         (ROW($E$19:$E$308)-ROW($E$19)+1)/($E$19:$E$308<>\"\"),\n         ROW()-ROW($A$19)+1\n      )\n   ),\n\"\"))","v":""},null,{"$f":"IF($F$18<>\"\",\n\"\",\nIF(ROW()-ROW($C$19)+1<=ROWS('Ações gerais'!$A$4:$A$203),\n   INDEX('Ações gerais'!$A$4:$A$203, ROW()-ROW($C$19)+1),\n   INDEX(Operacionalização!$A$4:$A$93, ROW()-ROW($C$19)+1 - ROWS('Ações gerais'!$A$4:$A$203))\n))","v":0},null,{"$f":"IF($F$18<>\"\",\n\"\",\nIF(OR($C218=\"\",$C218=0),\n   \"\",\n   IF(COUNTIF($C$19:C218,C218)=1,C218,\"\")\n))","v":""}]
[{"$f":"IF($F$18<>\"\",\n$F$18,\nIFERROR(\n   INDEX($E$19:$E$308,\n      _xlfn.AGGREGATE(15,6,\n         (ROW($E$19:$E$308)-ROW($E$19)+1)/($E$19:$E$308<>\"\"),\n         ROW()-ROW($A$19)+1\n      )\n   ),\n\"\"))","v":""},null,{"$f":"IF($F$18<>\"\",\n\"\",\nIF(ROW()-ROW($C$19)+1<=ROWS('Ações gerais'!$A$4:$A$203),\n   INDEX('Ações gerais'!$A$4:$A$203, ROW()-ROW($C$19)+1),\n   INDEX(Operacionalização!$A$4:$A$93, ROW()-ROW($C$19)+1 - ROWS('Ações gerais'!$A$4:$A$203))\n))","v":"Chamamento público - Fomento à execução de ações culturais - Projeto (Decreto 11.453/2023 e Lei 14.903/2024) "},null,{"$f":"IF($F$18<>\"\",\n\"\",\nIF(OR($C219=\"\",$C219=0),\n   \"\",\n   IF(COUNTIF($C$19:C219,C219)=1,C219,\"\")\n))","v":"Chamamento público - Fomento à execução de ações culturais - Projeto (Decreto 11.453/2023 e Lei 14.903/2024) "}]
[{"$f":"IF($F$18<>\"\",\n$F$18,\nIFERROR(\n   INDEX($E$19:$E$308,\n      _xlfn.AGGREGATE(15,6,\n         (ROW($E$19:$E$308)-ROW($E$19)+1)/($E$19:$E$308<>\"\"),\n         ROW()-ROW($A$19)+1\n      )\n   ),\n\"\"))","v":""},null,{"$f":"IF($F$18<>\"\",\n\"\",\nIF(ROW()-ROW($C$19)+1<=ROWS('Ações gerais'!$A$4:$A$203),\n   INDEX('Ações gerais'!$A$4:$A$203, ROW()-ROW($C$19)+1),\n   INDEX(Operacionalização!$A$4:$A$93, ROW()-ROW($C$19)+1 - ROWS('Ações gerais'!$A$4:$A$203))\n))","v":0},null,{"$f":"IF($F$18<>\"\",\n\"\",\nIF(OR($C220=\"\",$C220=0),\n   \"\",\n   IF(COUNTIF($C$19:C220,C220)=1,C220,\"\")\n))","v":""}]
[{"$f":"IF($F$18<>\"\",\n$F$18,\nIFERROR(\n   INDEX($E$19:$E$308,\n      _xlfn.AGGREGATE(15,6,\n         (ROW($E$19:$E$308)-ROW($E$19)+1)/($E$19:$E$308<>\"\"),\n         ROW()-ROW($A$19)+1\n      )\n   ),\n\"\"))","v":""},null,{"$f":"IF($F$18<>\"\",\n\"\",\nIF(ROW()-ROW($C$19)+1<=ROWS('Ações gerais'!$A$4:$A$203),\n   INDEX('Ações gerais'!$A$4:$A$203, ROW()-ROW($C$19)+1),\n   INDEX(Operacionalização!$A$4:$A$93, ROW()-ROW($C$19)+1 - ROWS('Ações gerais'!$A$4:$A$203))\n))","v":0},null,{"$f":"IF($F$18<>\"\",\n\"\",\nIF(OR($C221=\"\",$C221=0),\n   \"\",\n   IF(COUNTIF($C$19:C221,C221)=1,C221,\"\")\n))","v":""}]
[{"$f":"IF($F$18<>\"\",\n$F$18,\nIFERROR(\n   INDEX($E$19:$E$308,\n      _xlfn.AGGREGATE(15,6,\n         (ROW($E$19:$E$308)-ROW($E$19)+1)/($E$19:$E$308<>\"\"),\n         ROW()-ROW($A$19)+1\n      )\n   ),\n\"\"))","v":""},null,{"$f":"IF($F$18<>\"\",\n\"\",\nIF(ROW()-ROW($C$19)+1<=ROWS('Ações gerais'!$A$4:$A$203),\n   INDEX('Ações gerais'!$A$4:$A$203, ROW()-ROW($C$19)+1),\n   INDEX(Operacionalização!$A$4:$A$93, ROW()-ROW($C$19)+1 - ROWS('Ações gerais'!$A$4:$A$203))\n))","v":0},null,{"$f":"IF($F$18<>\"\",\n\"\",\nIF(OR($C222=\"\",$C222=0),\n   \"\",\n   IF(COUNTIF($C$19:C222,C222)=1,C222,\"\")\n))","v":""}]
[{"$f":"IF($F$18<>\"\",\n$F$18,\nIFERROR(\n   INDEX($E$19:$E$308,\n      _xlfn.AGGREGATE(15,6,\n         (ROW($E$19:$E$308)-ROW($E$19)+1)/($E$19:$E$308<>\"\"),\n         ROW()-ROW($A$19)+1\n      )\n   ),\n\"\"))","v":""},null,{"$f":"IF($F$18<>\"\",\n\"\",\nIF(ROW()-ROW($C$19)+1<=ROWS('Ações gerais'!$A$4:$A$203),\n   INDEX('Ações gerais'!$A$4:$A$203, ROW()-ROW($C$19)+1),\n   INDEX(Operacionalização!$A$4:$A$93, ROW()-ROW($C$19)+1 - ROWS('Ações gerais'!$A$4:$A$203))\n))","v":0},null,{"$f":"IF($F$18<>\"\",\n\"\",\nIF(OR($C223=\"\",$C223=0),\n   \"\",\n   IF(COUNTIF($C$19:C223,C223)=1,C223,\"\")\n))","v":""}]
[{"$f":"IF($F$18<>\"\",\n$F$18,\nIFERROR(\n   INDEX($E$19:$E$308,\n      _xlfn.AGGREGATE(15,6,\n         (ROW($E$19:$E$308)-ROW($E$19)+1)/($E$19:$E$308<>\"\"),\n         ROW()-ROW($A$19)+1\n      )\n   ),\n\"\"))","v":""},null,{"$f":"IF($F$18<>\"\",\n\"\",\nIF(ROW()-ROW($C$19)+1<=ROWS('Ações gerais'!$A$4:$A$203),\n   INDEX('Ações gerais'!$A$4:$A$203, ROW()-ROW($C$19)+1),\n   INDEX(Operacionalização!$A$4:$A$93, ROW()-ROW($C$19)+1 - ROWS('Ações gerais'!$A$4:$A$203))\n))","v":0},null,{"$f":"IF($F$18<>\"\",\n\"\",\nIF(OR($C224=\"\",$C224=0),\n   \"\",\n   IF(COUNTIF($C$19:C224,C224)=1,C224,\"\")\n))","v":""}]
[{"$f":"IF($F$18<>\"\",\n$F$18,\nIFERROR(\n   INDEX($E$19:$E$308,\n      _xlfn.AGGREGATE(15,6,\n         (ROW($E$19:$E$308)-ROW($E$19)+1)/($E$19:$E$308<>\"\"),\n         ROW()-ROW($A$19)+1\n      )\n   ),\n\"\"))","v":""},null,{"$f":"IF($F$18<>\"\",\n\"\",\nIF(ROW()-ROW($C$19)+1<=ROWS('Ações gerais'!$A$4:$A$203),\n   INDEX('Ações gerais'!$A$4:$A$203, ROW()-ROW($C$19)+1),\n   INDEX(Operacionalização!$A$4:$A$93, ROW()-ROW($C$19)+1 - ROWS('Ações gerais'!$A$4:$A$203))\n))","v":0},null,{"$f":"IF($F$18<>\"\",\n\"\",\nIF(OR($C225=\"\",$C225=0),\n   \"\",\n   IF(COUNTIF($C$19:C225,C225)=1,C225,\"\")\n))","v":""}]
[{"$f":"IF($F$18<>\"\",\n$F$18,\nIFERROR(\n   INDEX($E$19:$E$308,\n      _xlfn.AGGREGATE(15,6,\n         (ROW($E$19:$E$308)-ROW($E$19)+1)/($E$19:$E$308<>\"\"),\n         ROW()-ROW($A$19)+1\n      )\n   ),\n\"\"))","v":""},null,{"$f":"IF($F$18<>\"\",\n\"\",\nIF(ROW()-ROW($C$19)+1<=ROWS('Ações gerais'!$A$4:$A$203),\n   INDEX('Ações gerais'!$A$4:$A$203, ROW()-ROW($C$19)+1),\n   INDEX(Operacionalização!$A$4:$A$93, ROW()-ROW($C$19)+1 - ROWS('Ações gerais'!$A$4:$A$203))\n))","v":0},null,{"$f":"IF($F$18<>\"\",\n\"\",\nIF(OR($C226=\"\",$C226=0),\n   \"\",\n   IF(COUNTIF($C$19:C226,C226)=1,C226,\"\")\n))","v":""}]
[{"$f":"IF($F$18<>\"\",\n$F$18,\nIFERROR(\n   INDEX($E$19:$E$308,\n      _xlfn.AGGREGATE(15,6,\n         (ROW($E$19:$E$308)-ROW($E$19)+1)/($E$19:$E$308<>\"\"),\n         ROW()-ROW($A$19)+1\n      )\n   ),\n\"\"))","v":""},null,{"$f":"IF($F$18<>\"\",\n\"\",\nIF(ROW()-ROW($C$19)+1<=ROWS('Ações gerais'!$A$4:$A$203),\n   INDEX('Ações gerais'!$A$4:$A$203, ROW()-ROW($C$19)+1),\n   INDEX(Operacionalização!$A$4:$A$93, ROW()-ROW($C$19)+1 - ROWS('Ações gerais'!$A$4:$A$203))\n))","v":0},null,{"$f":"IF($F$18<>\"\",\n\"\",\nIF(OR($C227=\"\",$C227=0),\n   \"\",\n   IF(COUNTIF($C$19:C227,C227)=1,C227,\"\")\n))","v":""}]
[{"$f":"IF($F$18<>\"\",\n$F$18,\nIFERROR(\n   INDEX($E$19:$E$308,\n      _xlfn.AGGREGATE(15,6,\n         (ROW($E$19:$E$308)-ROW($E$19)+1)/($E$19:$E$308<>\"\"),\n         ROW()-ROW($A$19)+1\n      )\n   ),\n\"\"))","v":""},null,{"$f":"IF($F$18<>\"\",\n\"\",\nIF(ROW()-ROW($C$19)+1<=ROWS('Ações gerais'!$A$4:$A$203),\n   INDEX('Ações gerais'!$A$4:$A$203, ROW()-ROW($C$19)+1),\n   INDEX(Operacionalização!$A$4:$A$93, ROW()-ROW($C$19)+1 - ROWS('Ações gerais'!$A$4:$A$203))\n))","v":0},null,{"$f":"IF($F$18<>\"\",\n\"\",\nIF(OR($C228=\"\",$C228=0),\n   \"\",\n   IF(COUNTIF($C$19:C228,C228)=1,C228,\"\")\n))","v":""}]
[{"$f":"IF($F$18<>\"\",\n$F$18,\nIFERROR(\n   INDEX($E$19:$E$308,\n      _xlfn.AGGREGATE(15,6,\n         (ROW($E$19:$E$308)-ROW($E$19)+1)/($E$19:$E$308<>\"\"),\n         ROW()-ROW($A$19)+1\n      )\n   ),\n\"\"))","v":""},null,{"$f":"IF($F$18<>\"\",\n\"\",\nIF(ROW()-ROW($C$19)+1<=ROWS('Ações gerais'!$A$4:$A$203),\n   INDEX('Ações gerais'!$A$4:$A$203, ROW()-ROW($C$19)+1),\n   INDEX(Operacionalização!$A$4:$A$93, ROW()-ROW($C$19)+1 - ROWS('Ações gerais'!$A$4:$A$203))\n))","v":0},null,{"$f":"IF($F$18<>\"\",\n\"\",\nIF(OR($C229=\"\",$C229=0),\n   \"\",\n   IF(COUNTIF($C$19:C229,C229)=1,C229,\"\")\n))","v":""}]
[{"$f":"IF($F$18<>\"\",\n$F$18,\nIFERROR(\n   INDEX($E$19:$E$308,\n      _xlfn.AGGREGATE(15,6,\n         (ROW($E$19:$E$308)-ROW($E$19)+1)/($E$19:$E$308<>\"\"),\n         ROW()-ROW($A$19)+1\n      )\n   ),\n\"\"))","v":""},null,{"$f":"IF($F$18<>\"\",\n\"\",\nIF(ROW()-ROW($C$19)+1<=ROWS('Ações gerais'!$A$4:$A$203),\n   INDEX('Ações gerais'!$A$4:$A$203, ROW()-ROW($C$19)+1),\n   INDEX(Operacionalização!$A$4:$A$93, ROW()-ROW($C$19)+1 - ROWS('Ações gerais'!$A$4:$A$203))\n))","v":0},null,{"$f":"IF($F$18<>\"\",\n\"\",\nIF(OR($C230=\"\",$C230=0),\n   \"\",\n   IF(COUNTIF($C$19:C230,C230)=1,C230,\"\")\n))","v":""}]
[{"$f":"IF($F$18<>\"\",\n$F$18,\nIFERROR(\n   INDEX($E$19:$E$308,\n      _xlfn.AGGREGATE(15,6,\n         (ROW($E$19:$E$308)-ROW($E$19)+1)/($E$19:$E$308<>\"\"),\n         ROW()-ROW($A$19)+1\n      )\n   ),\n\"\"))","v":""},null,{"$f":"IF($F$18<>\"\",\n\"\",\nIF(ROW()-ROW($C$19)+1<=ROWS('Ações gerais'!$A$4:$A$203),\n   INDEX('Ações gerais'!$A$4:$A$203, ROW()-ROW($C$19)+1),\n   INDEX(Operacionalização!$A$4:$A$93, ROW()-ROW($C$19)+1 - ROWS('Ações gerais'!$A$4:$A$203))\n))","v":0},null,{"$f":"IF($F$18<>\"\",\n\"\",\nIF(OR($C231=\"\",$C231=0),\n   \"\",\n   IF(COUNTIF($C$19:C231,C231)=1,C231,\"\")\n))","v":""}]
[{"$f":"IF($F$18<>\"\",\n$F$18,\nIFERROR(\n   INDEX($E$19:$E$308,\n      _xlfn.AGGREGATE(15,6,\n         (ROW($E$19:$E$308)-ROW($E$19)+1)/($E$19:$E$308<>\"\"),\n         ROW()-ROW($A$19)+1\n      )\n   ),\n\"\"))","v":""},null,{"$f":"IF($F$18<>\"\",\n\"\",\nIF(ROW()-ROW($C$19)+1<=ROWS('Ações gerais'!$A$4:$A$203),\n   INDEX('Ações gerais'!$A$4:$A$203, ROW()-ROW($C$19)+1),\n   INDEX(Operacionalização!$A$4:$A$93, ROW()-ROW($C$19)+1 - ROWS('Ações gerais'!$A$4:$A$203))\n))","v":0},null,{"$f":"IF($F$18<>\"\",\n\"\",\nIF(OR($C232=\"\",$C232=0),\n   \"\",\n   IF(COUNTIF($C$19:C232,C232)=1,C232,\"\")\n))","v":""}]
[{"$f":"IF($F$18<>\"\",\n$F$18,\nIFERROR(\n   INDEX($E$19:$E$308,\n      _xlfn.AGGREGATE(15,6,\n         (ROW($E$19:$E$308)-ROW($E$19)+1)/($E$19:$E$308<>\"\"),\n         ROW()-ROW($A$19)+1\n      )\n   ),\n\"\"))","v":""},null,{"$f":"IF($F$18<>\"\",\n\"\",\nIF(ROW()-ROW($C$19)+1<=ROWS('Ações gerais'!$A$4:$A$203),\n   INDEX('Ações gerais'!$A$4:$A$203, ROW()-ROW($C$19)+1),\n   INDEX(Operacionalização!$A$4:$A$93, ROW()-ROW($C$19)+1 - ROWS('Ações gerais'!$A$4:$A$203))\n))","v":0},null,{"$f":"IF($F$18<>\"\",\n\"\",\nIF(OR($C233=\"\",$C233=0),\n   \"\",\n   IF(COUNTIF($C$19:C233,C233)=1,C233,\"\")\n))","v":""}]
[{"$f":"IF($F$18<>\"\",\n$F$18,\nIFERROR(\n   INDEX($E$19:$E$308,\n      _xlfn.AGGREGATE(15,6,\n         (ROW($E$19:$E$308)-ROW($E$19)+1)/($E$19:$E$308<>\"\"),\n         ROW()-ROW($A$19)+1\n      )\n   ),\n\"\"))","v":""},null,{"$f":"IF($F$18<>\"\",\n\"\",\nIF(ROW()-ROW($C$19)+1<=ROWS('Ações gerais'!$A$4:$A$203),\n   INDEX('Ações gerais'!$A$4:$A$203, ROW()-ROW($C$19)+1),\n   INDEX(Operacionalização!$A$4:$A$93, ROW()-ROW($C$19)+1 - ROWS('Ações gerais'!$A$4:$A$203))\n))","v":0},null,{"$f":"IF($F$18<>\"\",\n\"\",\nIF(OR($C234=\"\",$C234=0),\n   \"\",\n   IF(COUNTIF($C$19:C234,C234)=1,C234,\"\")\n))","v":""}]
[{"$f":"IF($F$18<>\"\",\n$F$18,\nIFERROR(\n   INDEX($E$19:$E$308,\n      _xlfn.AGGREGATE(15,6,\n         (ROW($E$19:$E$308)-ROW($E$19)+1)/($E$19:$E$308<>\"\"),\n         ROW()-ROW($A$19)+1\n      )\n   ),\n\"\"))","v":""},null,{"$f":"IF($F$18<>\"\",\n\"\",\nIF(ROW()-ROW($C$19)+1<=ROWS('Ações gerais'!$A$4:$A$203),\n   INDEX('Ações gerais'!$A$4:$A$203, ROW()-ROW($C$19)+1),\n   INDEX(Operacionalização!$A$4:$A$93, ROW()-ROW($C$19)+1 - ROWS('Ações gerais'!$A$4:$A$203))\n))","v":0},null,{"$f":"IF($F$18<>\"\",\n\"\",\nIF(OR($C235=\"\",$C235=0),\n   \"\",\n   IF(COUNTIF($C$19:C235,C235)=1,C235,\"\")\n))","v":""}]
[{"$f":"IF($F$18<>\"\",\n$F$18,\nIFERROR(\n   INDEX($E$19:$E$308,\n      _xlfn.AGGREGATE(15,6,\n         (ROW($E$19:$E$308)-ROW($E$19)+1)/($E$19:$E$308<>\"\"),\n         ROW()-ROW($A$19)+1\n      )\n   ),\n\"\"))","v":""},null,{"$f":"IF($F$18<>\"\",\n\"\",\nIF(ROW()-ROW($C$19)+1<=ROWS('Ações gerais'!$A$4:$A$203),\n   INDEX('Ações gerais'!$A$4:$A$203, ROW()-ROW($C$19)+1),\n   INDEX(Operacionalização!$A$4:$A$93, ROW()-ROW($C$19)+1 - ROWS('Ações gerais'!$A$4:$A$203))\n))","v":0},null,{"$f":"IF($F$18<>\"\",\n\"\",\nIF(OR($C236=\"\",$C236=0),\n   \"\",\n   IF(COUNTIF($C$19:C236,C236)=1,C236,\"\")\n))","v":""}]
[{"$f":"IF($F$18<>\"\",\n$F$18,\nIFERROR(\n   INDEX($E$19:$E$308,\n      _xlfn.AGGREGATE(15,6,\n         (ROW($E$19:$E$308)-ROW($E$19)+1)/($E$19:$E$308<>\"\"),\n         ROW()-ROW($A$19)+1\n      )\n   ),\n\"\"))","v":""},null,{"$f":"IF($F$18<>\"\",\n\"\",\nIF(ROW()-ROW($C$19)+1<=ROWS('Ações gerais'!$A$4:$A$203),\n   INDEX('Ações gerais'!$A$4:$A$203, ROW()-ROW($C$19)+1),\n   INDEX(Operacionalização!$A$4:$A$93, ROW()-ROW($C$19)+1 - ROWS('Ações gerais'!$A$4:$A$203))\n))","v":0},null,{"$f":"IF($F$18<>\"\",\n\"\",\nIF(OR($C237=\"\",$C237=0),\n   \"\",\n   IF(COUNTIF($C$19:C237,C237)=1,C237,\"\")\n))","v":""}]
[{"$f":"IF($F$18<>\"\",\n$F$18,\nIFERROR(\n   INDEX($E$19:$E$308,\n      _xlfn.AGGREGATE(15,6,\n         (ROW($E$19:$E$308)-ROW($E$19)+1)/($E$19:$E$308<>\"\"),\n         ROW()-ROW($A$19)+1\n      )\n   ),\n\"\"))","v":""},null,{"$f":"IF($F$18<>\"\",\n\"\",\nIF(ROW()-ROW($C$19)+1<=ROWS('Ações gerais'!$A$4:$A$203),\n   INDEX('Ações gerais'!$A$4:$A$203, ROW()-ROW($C$19)+1),\n   INDEX(Operacionalização!$A$4:$A$93, ROW()-ROW($C$19)+1 - ROWS('Ações gerais'!$A$4:$A$203))\n))","v":0},null,{"$f":"IF($F$18<>\"\",\n\"\",\nIF(OR($C238=\"\",$C238=0),\n   \"\",\n   IF(COUNTIF($C$19:C238,C238)=1,C238,\"\")\n))","v":""}]
[{"$f":"IF($F$18<>\"\",\n$F$18,\nIFERROR(\n   INDEX($E$19:$E$308,\n      _xlfn.AGGREGATE(15,6,\n         (ROW($E$19:$E$308)-ROW($E$19)+1)/($E$19:$E$308<>\"\"),\n         ROW()-ROW($A$19)+1\n      )\n   ),\n\"\"))","v":""},null,{"$f":"IF($F$18<>\"\",\n\"\",\nIF(ROW()-ROW($C$19)+1<=ROWS('Ações gerais'!$A$4:$A$203),\n   INDEX('Ações gerais'!$A$4:$A$203, ROW()-ROW($C$19)+1),\n   INDEX(Operacionalização!$A$4:$A$93, ROW()-ROW($C$19)+1 - ROWS('Ações gerais'!$A$4:$A$203))\n))","v":0},null,{"$f":"IF($F$18<>\"\",\n\"\",\nIF(OR($C239=\"\",$C239=0),\n   \"\",\n   IF(COUNTIF($C$19:C239,C239)=1,C239,\"\")\n))","v":""}]
[{"$f":"IF($F$18<>\"\",\n$F$18,\nIFERROR(\n   INDEX($E$19:$E$308,\n      _xlfn.AGGREGATE(15,6,\n         (ROW($E$19:$E$308)-ROW($E$19)+1)/($E$19:$E$308<>\"\"),\n         ROW()-ROW($A$19)+1\n      )\n   ),\n\"\"))","v":""},null,{"$f":"IF($F$18<>\"\",\n\"\",\nIF(ROW()-ROW($C$19)+1<=ROWS('Ações gerais'!$A$4:$A$203),\n   INDEX('Ações gerais'!$A$4:$A$203, ROW()-ROW($C$19)+1),\n   INDEX(Operacionalização!$A$4:$A$93, ROW()-ROW($C$19)+1 - ROWS('Ações gerais'!$A$4:$A$203))\n))","v":0},null,{"$f":"IF($F$18<>\"\",\n\"\",\nIF(OR($C240=\"\",$C240=0),\n   \"\",\n   IF(COUNTIF($C$19:C240,C240)=1,C240,\"\")\n))","v":""}]
[{"$f":"IF($F$18<>\"\",\n$F$18,\nIFERROR(\n   INDEX($E$19:$E$308,\n      _xlfn.AGGREGATE(15,6,\n         (ROW($E$19:$E$308)-ROW($E$19)+1)/($E$19:$E$308<>\"\"),\n         ROW()-ROW($A$19)+1\n      )\n   ),\n\"\"))","v":""},null,{"$f":"IF($F$18<>\"\",\n\"\",\nIF(ROW()-ROW($C$19)+1<=ROWS('Ações gerais'!$A$4:$A$203),\n   INDEX('Ações gerais'!$A$4:$A$203, ROW()-ROW($C$19)+1),\n   INDEX(Operacionalização!$A$4:$A$93, ROW()-ROW($C$19)+1 - ROWS('Ações gerais'!$A$4:$A$203))\n))","v":0},null,{"$f":"IF($F$18<>\"\",\n\"\",\nIF(OR($C241=\"\",$C241=0),\n   \"\",\n   IF(COUNTIF($C$19:C241,C241)=1,C241,\"\")\n))","v":""}]
[{"$f":"IF($F$18<>\"\",\n$F$18,\nIFERROR(\n   INDEX($E$19:$E$308,\n      _xlfn.AGGREGATE(15,6,\n         (ROW($E$19:$E$308)-ROW($E$19)+1)/($E$19:$E$308<>\"\"),\n         ROW()-ROW($A$19)+1\n      )\n   ),\n\"\"))","v":""},null,{"$f":"IF($F$18<>\"\",\n\"\",\nIF(ROW()-ROW($C$19)+1<=ROWS('Ações gerais'!$A$4:$A$203),\n   INDEX('Ações gerais'!$A$4:$A$203, ROW()-ROW($C$19)+1),\n   INDEX(Operacionalização!$A$4:$A$93, ROW()-ROW($C$19)+1 - ROWS('Ações gerais'!$A$4:$A$203))\n))","v":0},null,{"$f":"IF($F$18<>\"\",\n\"\",\nIF(OR($C242=\"\",$C242=0),\n   \"\",\n   IF(COUNTIF($C$19:C242,C242)=1,C242,\"\")\n))","v":""}]
[{"$f":"IF($F$18<>\"\",\n$F$18,\nIFERROR(\n   INDEX($E$19:$E$308,\n      _xlfn.AGGREGATE(15,6,\n         (ROW($E$19:$E$308)-ROW($E$19)+1)/($E$19:$E$308<>\"\"),\n         ROW()-ROW($A$19)+1\n      )\n   ),\n\"\"))","v":""},null,{"$f":"IF($F$18<>\"\",\n\"\",\nIF(ROW()-ROW($C$19)+1<=ROWS('Ações gerais'!$A$4:$A$203),\n   INDEX('Ações gerais'!$A$4:$A$203, ROW()-ROW($C$19)+1),\n   INDEX(Operacionalização!$A$4:$A$93, ROW()-ROW($C$19)+1 - ROWS('Ações gerais'!$A$4:$A$203))\n))","v":0},null,{"$f":"IF($F$18<>\"\",\n\"\",\nIF(OR($C243=\"\",$C243=0),\n   \"\",\n   IF(COUNTIF($C$19:C243,C243)=1,C243,\"\")\n))","v":""}]
[{"$f":"IF($F$18<>\"\",\n$F$18,\nIFERROR(\n   INDEX($E$19:$E$308,\n      _xlfn.AGGREGATE(15,6,\n         (ROW($E$19:$E$308)-ROW($E$19)+1)/($E$19:$E$308<>\"\"),\n         ROW()-ROW($A$19)+1\n      )\n   ),\n\"\"))","v":""},null,{"$f":"IF($F$18<>\"\",\n\"\",\nIF(ROW()-ROW($C$19)+1<=ROWS('Ações gerais'!$A$4:$A$203),\n   INDEX('Ações gerais'!$A$4:$A$203, ROW()-ROW($C$19)+1),\n   INDEX(Operacionalização!$A$4:$A$93, ROW()-ROW($C$19)+1 - ROWS('Ações gerais'!$A$4:$A$203))\n))","v":0},null,{"$f":"IF($F$18<>\"\",\n\"\",\nIF(OR($C244=\"\",$C244=0),\n   \"\",\n   IF(COUNTIF($C$19:C244,C244)=1,C244,\"\")\n))","v":""}]
[{"$f":"IF($F$18<>\"\",\n$F$18,\nIFERROR(\n   INDEX($E$19:$E$308,\n      _xlfn.AGGREGATE(15,6,\n         (ROW($E$19:$E$308)-ROW($E$19)+1)/($E$19:$E$308<>\"\"),\n         ROW()-ROW($A$19)+1\n      )\n   ),\n\"\"))","v":""},null,{"$f":"IF($F$18<>\"\",\n\"\",\nIF(ROW()-ROW($C$19)+1<=ROWS('Ações gerais'!$A$4:$A$203),\n   INDEX('Ações gerais'!$A$4:$A$203, ROW()-ROW($C$19)+1),\n   INDEX(Operacionalização!$A$4:$A$93, ROW()-ROW($C$19)+1 - ROWS('Ações gerais'!$A$4:$A$203))\n))","v":0},null,{"$f":"IF($F$18<>\"\",\n\"\",\nIF(OR($C245=\"\",$C245=0),\n   \"\",\n   IF(COUNTIF($C$19:C245,C245)=1,C245,\"\")\n))","v":""}]
[{"$f":"IF($F$18<>\"\",\n$F$18,\nIFERROR(\n   INDEX($E$19:$E$308,\n      _xlfn.AGGREGATE(15,6,\n         (ROW($E$19:$E$308)-ROW($E$19)+1)/($E$19:$E$308<>\"\"),\n         ROW()-ROW($A$19)+1\n      )\n   ),\n\"\"))","v":""},null,{"$f":"IF($F$18<>\"\",\n\"\",\nIF(ROW()-ROW($C$19)+1<=ROWS('Ações gerais'!$A$4:$A$203),\n   INDEX('Ações gerais'!$A$4:$A$203, ROW()-ROW($C$19)+1),\n   INDEX(Operacionalização!$A$4:$A$93, ROW()-ROW($C$19)+1 - ROWS('Ações gerais'!$A$4:$A$203))\n))","v":0},null,{"$f":"IF($F$18<>\"\",\n\"\",\nIF(OR($C246=\"\",$C246=0),\n   \"\",\n   IF(COUNTIF($C$19:C246,C246)=1,C246,\"\")\n))","v":""}]
[{"$f":"IF($F$18<>\"\",\n$F$18,\nIFERROR(\n   INDEX($E$19:$E$308,\n      _xlfn.AGGREGATE(15,6,\n         (ROW($E$19:$E$308)-ROW($E$19)+1)/($E$19:$E$308<>\"\"),\n         ROW()-ROW($A$19)+1\n      )\n   ),\n\"\"))","v":""},null,{"$f":"IF($F$18<>\"\",\n\"\",\nIF(ROW()-ROW($C$19)+1<=ROWS('Ações gerais'!$A$4:$A$203),\n   INDEX('Ações gerais'!$A$4:$A$203, ROW()-ROW($C$19)+1),\n   INDEX(Operacionalização!$A$4:$A$93, ROW()-ROW($C$19)+1 - ROWS('Ações gerais'!$A$4:$A$203))\n))","v":0},null,{"$f":"IF($F$18<>\"\",\n\"\",\nIF(OR($C247=\"\",$C247=0),\n   \"\",\n   IF(COUNTIF($C$19:C247,C247)=1,C247,\"\")\n))","v":""}]
[{"$f":"IF($F$18<>\"\",\n$F$18,\nIFERROR(\n   INDEX($E$19:$E$308,\n      _xlfn.AGGREGATE(15,6,\n         (ROW($E$19:$E$308)-ROW($E$19)+1)/($E$19:$E$308<>\"\"),\n         ROW()-ROW($A$19)+1\n      )\n   ),\n\"\"))","v":""},null,{"$f":"IF($F$18<>\"\",\n\"\",\nIF(ROW()-ROW($C$19)+1<=ROWS('Ações gerais'!$A$4:$A$203),\n   INDEX('Ações gerais'!$A$4:$A$203, ROW()-ROW($C$19)+1),\n   INDEX(Operacionalização!$A$4:$A$93, ROW()-ROW($C$19)+1 - ROWS('Ações gerais'!$A$4:$A$203))\n))","v":0},null,{"$f":"IF($F$18<>\"\",\n\"\",\nIF(OR($C248=\"\",$C248=0),\n   \"\",\n   IF(COUNTIF($C$19:C248,C248)=1,C248,\"\")\n))","v":""}]
[{"$f":"IF($F$18<>\"\",\n$F$18,\nIFERROR(\n   INDEX($E$19:$E$308,\n      _xlfn.AGGREGATE(15,6,\n         (ROW($E$19:$E$308)-ROW($E$19)+1)/($E$19:$E$308<>\"\"),\n         ROW()-ROW($A$19)+1\n      )\n   ),\n\"\"))","v":""},null,{"$f":"IF($F$18<>\"\",\n\"\",\nIF(ROW()-ROW($C$19)+1<=ROWS('Ações gerais'!$A$4:$A$203),\n   INDEX('Ações gerais'!$A$4:$A$203, ROW()-ROW($C$19)+1),\n   INDEX(Operacionalização!$A$4:$A$93, ROW()-ROW($C$19)+1 - ROWS('Ações gerais'!$A$4:$A$203))\n))","v":0},null,{"$f":"IF($F$18<>\"\",\n\"\",\nIF(OR($C249=\"\",$C249=0),\n   \"\",\n   IF(COUNTIF($C$19:C249,C249)=1,C249,\"\")\n))","v":""}]
[{"$f":"IF($F$18<>\"\",\n$F$18,\nIFERROR(\n   INDEX($E$19:$E$308,\n      _xlfn.AGGREGATE(15,6,\n         (ROW($E$19:$E$308)-ROW($E$19)+1)/($E$19:$E$308<>\"\"),\n         ROW()-ROW($A$19)+1\n      )\n   ),\n\"\"))","v":""},null,{"$f":"IF($F$18<>\"\",\n\"\",\nIF(ROW()-ROW($C$19)+1<=ROWS('Ações gerais'!$A$4:$A$203),\n   INDEX('Ações gerais'!$A$4:$A$203, ROW()-ROW($C$19)+1),\n   INDEX(Operacionalização!$A$4:$A$93, ROW()-ROW($C$19)+1 - ROWS('Ações gerais'!$A$4:$A$203))\n))","v":0},null,{"$f":"IF($F$18<>\"\",\n\"\",\nIF(OR($C250=\"\",$C250=0),\n   \"\",\n   IF(COUNTIF($C$19:C250,C250)=1,C250,\"\")\n))","v":""}]
[{"$f":"IF($F$18<>\"\",\n$F$18,\nIFERROR(\n   INDEX($E$19:$E$308,\n      _xlfn.AGGREGATE(15,6,\n         (ROW($E$19:$E$308)-ROW($E$19)+1)/($E$19:$E$308<>\"\"),\n         ROW()-ROW($A$19)+1\n      )\n   ),\n\"\"))","v":""},null,{"$f":"IF($F$18<>\"\",\n\"\",\nIF(ROW()-ROW($C$19)+1<=ROWS('Ações gerais'!$A$4:$A$203),\n   INDEX('Ações gerais'!$A$4:$A$203, ROW()-ROW($C$19)+1),\n   INDEX(Operacionalização!$A$4:$A$93, ROW()-ROW($C$19)+1 - ROWS('Ações gerais'!$A$4:$A$203))\n))","v":0},null,{"$f":"IF($F$18<>\"\",\n\"\",\nIF(OR($C251=\"\",$C251=0),\n   \"\",\n   IF(COUNTIF($C$19:C251,C251)=1,C251,\"\")\n))","v":""}]
[{"$f":"IF($F$18<>\"\",\n$F$18,\nIFERROR(\n   INDEX($E$19:$E$308,\n      _xlfn.AGGREGATE(15,6,\n         (ROW($E$19:$E$308)-ROW($E$19)+1)/($E$19:$E$308<>\"\"),\n         ROW()-ROW($A$19)+1\n      )\n   ),\n\"\"))","v":""},null,{"$f":"IF($F$18<>\"\",\n\"\",\nIF(ROW()-ROW($C$19)+1<=ROWS('Ações gerais'!$A$4:$A$203),\n   INDEX('Ações gerais'!$A$4:$A$203, ROW()-ROW($C$19)+1),\n   INDEX(Operacionalização!$A$4:$A$93, ROW()-ROW($C$19)+1 - ROWS('Ações gerais'!$A$4:$A$203))\n))","v":0},null,{"$f":"IF($F$18<>\"\",\n\"\",\nIF(OR($C252=\"\",$C252=0),\n   \"\",\n   IF(COUNTIF($C$19:C252,C252)=1,C252,\"\")\n))","v":""}]
[{"$f":"IF($F$18<>\"\",\n$F$18,\nIFERROR(\n   INDEX($E$19:$E$308,\n      _xlfn.AGGREGATE(15,6,\n         (ROW($E$19:$E$308)-ROW($E$19)+1)/($E$19:$E$308<>\"\"),\n         ROW()-ROW($A$19)+1\n      )\n   ),\n\"\"))","v":""},null,{"$f":"IF($F$18<>\"\",\n\"\",\nIF(ROW()-ROW($C$19)+1<=ROWS('Ações gerais'!$A$4:$A$203),\n   INDEX('Ações gerais'!$A$4:$A$203, ROW()-ROW($C$19)+1),\n   INDEX(Operacionalização!$A$4:$A$93, ROW()-ROW($C$19)+1 - ROWS('Ações gerais'!$A$4:$A$203))\n))","v":0},null,{"$f":"IF($F$18<>\"\",\n\"\",\nIF(OR($C253=\"\",$C253=0),\n   \"\",\n   IF(COUNTIF($C$19:C253,C253)=1,C253,\"\")\n))","v":""}]
[{"$f":"IF($F$18<>\"\",\n$F$18,\nIFERROR(\n   INDEX($E$19:$E$308,\n      _xlfn.AGGREGATE(15,6,\n         (ROW($E$19:$E$308)-ROW($E$19)+1)/($E$19:$E$308<>\"\"),\n         ROW()-ROW($A$19)+1\n      )\n   ),\n\"\"))","v":""},null,{"$f":"IF($F$18<>\"\",\n\"\",\nIF(ROW()-ROW($C$19)+1<=ROWS('Ações gerais'!$A$4:$A$203),\n   INDEX('Ações gerais'!$A$4:$A$203, ROW()-ROW($C$19)+1),\n   INDEX(Operacionalização!$A$4:$A$93, ROW()-ROW($C$19)+1 - ROWS('Ações gerais'!$A$4:$A$203))\n))","v":0},null,{"$f":"IF($F$18<>\"\",\n\"\",\nIF(OR($C254=\"\",$C254=0),\n   \"\",\n   IF(COUNTIF($C$19:C254,C254)=1,C254,\"\")\n))","v":""}]
[{"$f":"IF($F$18<>\"\",\n$F$18,\nIFERROR(\n   INDEX($E$19:$E$308,\n      _xlfn.AGGREGATE(15,6,\n         (ROW($E$19:$E$308)-ROW($E$19)+1)/($E$19:$E$308<>\"\"),\n         ROW()-ROW($A$19)+1\n      )\n   ),\n\"\"))","v":""},null,{"$f":"IF($F$18<>\"\",\n\"\",\nIF(ROW()-ROW($C$19)+1<=ROWS('Ações gerais'!$A$4:$A$203),\n   INDEX('Ações gerais'!$A$4:$A$203, ROW()-ROW($C$19)+1),\n   INDEX(Operacionalização!$A$4:$A$93, ROW()-ROW($C$19)+1 - ROWS('Ações gerais'!$A$4:$A$203))\n))","v":0},null,{"$f":"IF($F$18<>\"\",\n\"\",\nIF(OR($C255=\"\",$C255=0),\n   \"\",\n   IF(COUNTIF($C$19:C255,C255)=1,C255,\"\")\n))","v":""}]
[{"$f":"IF($F$18<>\"\",\n$F$18,\nIFERROR(\n   INDEX($E$19:$E$308,\n      _xlfn.AGGREGATE(15,6,\n         (ROW($E$19:$E$308)-ROW($E$19)+1)/($E$19:$E$308<>\"\"),\n         ROW()-ROW($A$19)+1\n      )\n   ),\n\"\"))","v":""},null,{"$f":"IF($F$18<>\"\",\n\"\",\nIF(ROW()-ROW($C$19)+1<=ROWS('Ações gerais'!$A$4:$A$203),\n   INDEX('Ações gerais'!$A$4:$A$203, ROW()-ROW($C$19)+1),\n   INDEX(Operacionalização!$A$4:$A$93, ROW()-ROW($C$19)+1 - ROWS('Ações gerais'!$A$4:$A$203))\n))","v":0},null,{"$f":"IF($F$18<>\"\",\n\"\",\nIF(OR($C256=\"\",$C256=0),\n   \"\",\n   IF(COUNTIF($C$19:C256,C256)=1,C256,\"\")\n))","v":""}]
[{"$f":"IF($F$18<>\"\",\n$F$18,\nIFERROR(\n   INDEX($E$19:$E$308,\n      _xlfn.AGGREGATE(15,6,\n         (ROW($E$19:$E$308)-ROW($E$19)+1)/($E$19:$E$308<>\"\"),\n         ROW()-ROW($A$19)+1\n      )\n   ),\n\"\"))","v":""},null,{"$f":"IF($F$18<>\"\",\n\"\",\nIF(ROW()-ROW($C$19)+1<=ROWS('Ações gerais'!$A$4:$A$203),\n   INDEX('Ações gerais'!$A$4:$A$203, ROW()-ROW($C$19)+1),\n   INDEX(Operacionalização!$A$4:$A$93, ROW()-ROW($C$19)+1 - ROWS('Ações gerais'!$A$4:$A$203))\n))","v":0},null,{"$f":"IF($F$18<>\"\",\n\"\",\nIF(OR($C257=\"\",$C257=0),\n   \"\",\n   IF(COUNTIF($C$19:C257,C257)=1,C257,\"\")\n))","v":""}]
[{"$f":"IF($F$18<>\"\",\n$F$18,\nIFERROR(\n   INDEX($E$19:$E$308,\n      _xlfn.AGGREGATE(15,6,\n         (ROW($E$19:$E$308)-ROW($E$19)+1)/($E$19:$E$308<>\"\"),\n         ROW()-ROW($A$19)+1\n      )\n   ),\n\"\"))","v":""},null,{"$f":"IF($F$18<>\"\",\n\"\",\nIF(ROW()-ROW($C$19)+1<=ROWS('Ações gerais'!$A$4:$A$203),\n   INDEX('Ações gerais'!$A$4:$A$203, ROW()-ROW($C$19)+1),\n   INDEX(Operacionalização!$A$4:$A$93, ROW()-ROW($C$19)+1 - ROWS('Ações gerais'!$A$4:$A$203))\n))","v":0},null,{"$f":"IF($F$18<>\"\",\n\"\",\nIF(OR($C258=\"\",$C258=0),\n   \"\",\n   IF(COUNTIF($C$19:C258,C258)=1,C258,\"\")\n))","v":""}]
[{"$f":"IF($F$18<>\"\",\n$F$18,\nIFERROR(\n   INDEX($E$19:$E$308,\n      _xlfn.AGGREGATE(15,6,\n         (ROW($E$19:$E$308)-ROW($E$19)+1)/($E$19:$E$308<>\"\"),\n         ROW()-ROW($A$19)+1\n      )\n   ),\n\"\"))","v":""},null,{"$f":"IF($F$18<>\"\",\n\"\",\nIF(ROW()-ROW($C$19)+1<=ROWS('Ações gerais'!$A$4:$A$203),\n   INDEX('Ações gerais'!$A$4:$A$203, ROW()-ROW($C$19)+1),\n   INDEX(Operacionalização!$A$4:$A$93, ROW()-ROW($C$19)+1 - ROWS('Ações gerais'!$A$4:$A$203))\n))","v":0},null,{"$f":"IF($F$18<>\"\",\n\"\",\nIF(OR($C259=\"\",$C259=0),\n   \"\",\n   IF(COUNTIF($C$19:C259,C259)=1,C259,\"\")\n))","v":""}]
[{"$f":"IF($F$18<>\"\",\n$F$18,\nIFERROR(\n   INDEX($E$19:$E$308,\n      _xlfn.AGGREGATE(15,6,\n         (ROW($E$19:$E$308)-ROW($E$19)+1)/($E$19:$E$308<>\"\"),\n         ROW()-ROW($A$19)+1\n      )\n   ),\n\"\"))","v":""},null,{"$f":"IF($F$18<>\"\",\n\"\",\nIF(ROW()-ROW($C$19)+1<=ROWS('Ações gerais'!$A$4:$A$203),\n   INDEX('Ações gerais'!$A$4:$A$203, ROW()-ROW($C$19)+1),\n   INDEX(Operacionalização!$A$4:$A$93, ROW()-ROW($C$19)+1 - ROWS('Ações gerais'!$A$4:$A$203))\n))","v":0},null,{"$f":"IF($F$18<>\"\",\n\"\",\nIF(OR($C260=\"\",$C260=0),\n   \"\",\n   IF(COUNTIF($C$19:C260,C260)=1,C260,\"\")\n))","v":""}]
[{"$f":"IF($F$18<>\"\",\n$F$18,\nIFERROR(\n   INDEX($E$19:$E$308,\n      _xlfn.AGGREGATE(15,6,\n         (ROW($E$19:$E$308)-ROW($E$19)+1)/($E$19:$E$308<>\"\"),\n         ROW()-ROW($A$19)+1\n      )\n   ),\n\"\"))","v":""},null,{"$f":"IF($F$18<>\"\",\n\"\",\nIF(ROW()-ROW($C$19)+1<=ROWS('Ações gerais'!$A$4:$A$203),\n   INDEX('Ações gerais'!$A$4:$A$203, ROW()-ROW($C$19)+1),\n   INDEX(Operacionalização!$A$4:$A$93, ROW()-ROW($C$19)+1 - ROWS('Ações gerais'!$A$4:$A$203))\n))","v":0},null,{"$f":"IF($F$18<>\"\",\n\"\",\nIF(OR($C261=\"\",$C261=0),\n   \"\",\n   IF(COUNTIF($C$19:C261,C261)=1,C261,\"\")\n))","v":""}]
[{"$f":"IF($F$18<>\"\",\n$F$18,\nIFERROR(\n   INDEX($E$19:$E$308,\n      _xlfn.AGGREGATE(15,6,\n         (ROW($E$19:$E$308)-ROW($E$19)+1)/($E$19:$E$308<>\"\"),\n         ROW()-ROW($A$19)+1\n      )\n   ),\n\"\"))","v":""},null,{"$f":"IF($F$18<>\"\",\n\"\",\nIF(ROW()-ROW($C$19)+1<=ROWS('Ações gerais'!$A$4:$A$203),\n   INDEX('Ações gerais'!$A$4:$A$203, ROW()-ROW($C$19)+1),\n   INDEX(Operacionalização!$A$4:$A$93, ROW()-ROW($C$19)+1 - ROWS('Ações gerais'!$A$4:$A$203))\n))","v":0},null,{"$f":"IF($F$18<>\"\",\n\"\",\nIF(OR($C262=\"\",$C262=0),\n   \"\",\n   IF(COUNTIF($C$19:C262,C262)=1,C262,\"\")\n))","v":""}]
[{"$f":"IF($F$18<>\"\",\n$F$18,\nIFERROR(\n   INDEX($E$19:$E$308,\n      _xlfn.AGGREGATE(15,6,\n         (ROW($E$19:$E$308)-ROW($E$19)+1)/($E$19:$E$308<>\"\"),\n         ROW()-ROW($A$19)+1\n      )\n   ),\n\"\"))","v":""},null,{"$f":"IF($F$18<>\"\",\n\"\",\nIF(ROW()-ROW($C$19)+1<=ROWS('Ações gerais'!$A$4:$A$203),\n   INDEX('Ações gerais'!$A$4:$A$203, ROW()-ROW($C$19)+1),\n   INDEX(Operacionalização!$A$4:$A$93, ROW()-ROW($C$19)+1 - ROWS('Ações gerais'!$A$4:$A$203))\n))","v":0},null,{"$f":"IF($F$18<>\"\",\n\"\",\nIF(OR($C263=\"\",$C263=0),\n   \"\",\n   IF(COUNTIF($C$19:C263,C263)=1,C263,\"\")\n))","v":""}]
[{"$f":"IF($F$18<>\"\",\n$F$18,\nIFERROR(\n   INDEX($E$19:$E$308,\n      _xlfn.AGGREGATE(15,6,\n         (ROW($E$19:$E$308)-ROW($E$19)+1)/($E$19:$E$308<>\"\"),\n         ROW()-ROW($A$19)+1\n      )\n   ),\n\"\"))","v":""},null,{"$f":"IF($F$18<>\"\",\n\"\",\nIF(ROW()-ROW($C$19)+1<=ROWS('Ações gerais'!$A$4:$A$203),\n   INDEX('Ações gerais'!$A$4:$A$203, ROW()-ROW($C$19)+1),\n   INDEX(Operacionalização!$A$4:$A$93, ROW()-ROW($C$19)+1 - ROWS('Ações gerais'!$A$4:$A$203))\n))","v":0},null,{"$f":"IF($F$18<>\"\",\n\"\",\nIF(OR($C264=\"\",$C264=0),\n   \"\",\n   IF(COUNTIF($C$19:C264,C264)=1,C264,\"\")\n))","v":""}]
[{"$f":"IF($F$18<>\"\",\n$F$18,\nIFERROR(\n   INDEX($E$19:$E$308,\n      _xlfn.AGGREGATE(15,6,\n         (ROW($E$19:$E$308)-ROW($E$19)+1)/($E$19:$E$308<>\"\"),\n         ROW()-ROW($A$19)+1\n      )\n   ),\n\"\"))","v":""},null,{"$f":"IF($F$18<>\"\",\n\"\",\nIF(ROW()-ROW($C$19)+1<=ROWS('Ações gerais'!$A$4:$A$203),\n   INDEX('Ações gerais'!$A$4:$A$203, ROW()-ROW($C$19)+1),\n   INDEX(Operacionalização!$A$4:$A$93, ROW()-ROW($C$19)+1 - ROWS('Ações gerais'!$A$4:$A$203))\n))","v":0},null,{"$f":"IF($F$18<>\"\",\n\"\",\nIF(OR($C265=\"\",$C265=0),\n   \"\",\n   IF(COUNTIF($C$19:C265,C265)=1,C265,\"\")\n))","v":""}]
[{"$f":"IF($F$18<>\"\",\n$F$18,\nIFERROR(\n   INDEX($E$19:$E$308,\n      _xlfn.AGGREGATE(15,6,\n         (ROW($E$19:$E$308)-ROW($E$19)+1)/($E$19:$E$308<>\"\"),\n         ROW()-ROW($A$19)+1\n      )\n   ),\n\"\"))","v":""},null,{"$f":"IF($F$18<>\"\",\n\"\",\nIF(ROW()-ROW($C$19)+1<=ROWS('Ações gerais'!$A$4:$A$203),\n   INDEX('Ações gerais'!$A$4:$A$203, ROW()-ROW($C$19)+1),\n   INDEX(Operacionalização!$A$4:$A$93, ROW()-ROW($C$19)+1 - ROWS('Ações gerais'!$A$4:$A$203))\n))","v":0},null,{"$f":"IF($F$18<>\"\",\n\"\",\nIF(OR($C266=\"\",$C266=0),\n   \"\",\n   IF(COUNTIF($C$19:C266,C266)=1,C266,\"\")\n))","v":""}]
[{"$f":"IF($F$18<>\"\",\n$F$18,\nIFERROR(\n   INDEX($E$19:$E$308,\n      _xlfn.AGGREGATE(15,6,\n         (ROW($E$19:$E$308)-ROW($E$19)+1)/($E$19:$E$308<>\"\"),\n         ROW()-ROW($A$19)+1\n      )\n   ),\n\"\"))","v":""},null,{"$f":"IF($F$18<>\"\",\n\"\",\nIF(ROW()-ROW($C$19)+1<=ROWS('Ações gerais'!$A$4:$A$203),\n   INDEX('Ações gerais'!$A$4:$A$203, ROW()-ROW($C$19)+1),\n   INDEX(Operacionalização!$A$4:$A$93, ROW()-ROW($C$19)+1 - ROWS('Ações gerais'!$A$4:$A$203))\n))","v":0},null,{"$f":"IF($F$18<>\"\",\n\"\",\nIF(OR($C267=\"\",$C267=0),\n   \"\",\n   IF(COUNTIF($C$19:C267,C267)=1,C267,\"\")\n))","v":""}]
[{"$f":"IF($F$18<>\"\",\n$F$18,\nIFERROR(\n   INDEX($E$19:$E$308,\n      _xlfn.AGGREGATE(15,6,\n         (ROW($E$19:$E$308)-ROW($E$19)+1)/($E$19:$E$308<>\"\"),\n         ROW()-ROW($A$19)+1\n      )\n   ),\n\"\"))","v":""},null,{"$f":"IF($F$18<>\"\",\n\"\",\nIF(ROW()-ROW($C$19)+1<=ROWS('Ações gerais'!$A$4:$A$203),\n   INDEX('Ações gerais'!$A$4:$A$203, ROW()-ROW($C$19)+1),\n   INDEX(Operacionalização!$A$4:$A$93, ROW()-ROW($C$19)+1 - ROWS('Ações gerais'!$A$4:$A$203))\n))","v":0},null,{"$f":"IF($F$18<>\"\",\n\"\",\nIF(OR($C268=\"\",$C268=0),\n   \"\",\n   IF(COUNTIF($C$19:C268,C268)=1,C268,\"\")\n))","v":""}]
[{"$f":"IF($F$18<>\"\",\n$F$18,\nIFERROR(\n   INDEX($E$19:$E$308,\n      _xlfn.AGGREGATE(15,6,\n         (ROW($E$19:$E$308)-ROW($E$19)+1)/($E$19:$E$308<>\"\"),\n         ROW()-ROW($A$19)+1\n      )\n   ),\n\"\"))","v":""},null,{"$f":"IF($F$18<>\"\",\n\"\",\nIF(ROW()-ROW($C$19)+1<=ROWS('Ações gerais'!$A$4:$A$203),\n   INDEX('Ações gerais'!$A$4:$A$203, ROW()-ROW($C$19)+1),\n   INDEX(Operacionalização!$A$4:$A$93, ROW()-ROW($C$19)+1 - ROWS('Ações gerais'!$A$4:$A$203))\n))","v":0},null,{"$f":"IF($F$18<>\"\",\n\"\",\nIF(OR($C269=\"\",$C269=0),\n   \"\",\n   IF(COUNTIF($C$19:C269,C269)=1,C269,\"\")\n))","v":""}]
[{"$f":"IF($F$18<>\"\",\n$F$18,\nIFERROR(\n   INDEX($E$19:$E$308,\n      _xlfn.AGGREGATE(15,6,\n         (ROW($E$19:$E$308)-ROW($E$19)+1)/($E$19:$E$308<>\"\"),\n         ROW()-ROW($A$19)+1\n      )\n   ),\n\"\"))","v":""},null,{"$f":"IF($F$18<>\"\",\n\"\",\nIF(ROW()-ROW($C$19)+1<=ROWS('Ações gerais'!$A$4:$A$203),\n   INDEX('Ações gerais'!$A$4:$A$203, ROW()-ROW($C$19)+1),\n   INDEX(Operacionalização!$A$4:$A$93, ROW()-ROW($C$19)+1 - ROWS('Ações gerais'!$A$4:$A$203))\n))","v":0},null,{"$f":"IF($F$18<>\"\",\n\"\",\nIF(OR($C270=\"\",$C270=0),\n   \"\",\n   IF(COUNTIF($C$19:C270,C270)=1,C270,\"\")\n))","v":""}]
[{"$f":"IF($F$18<>\"\",\n$F$18,\nIFERROR(\n   INDEX($E$19:$E$308,\n      _xlfn.AGGREGATE(15,6,\n         (ROW($E$19:$E$308)-ROW($E$19)+1)/($E$19:$E$308<>\"\"),\n         ROW()-ROW($A$19)+1\n      )\n   ),\n\"\"))","v":""},null,{"$f":"IF($F$18<>\"\",\n\"\",\nIF(ROW()-ROW($C$19)+1<=ROWS('Ações gerais'!$A$4:$A$203),\n   INDEX('Ações gerais'!$A$4:$A$203, ROW()-ROW($C$19)+1),\n   INDEX(Operacionalização!$A$4:$A$93, ROW()-ROW($C$19)+1 - ROWS('Ações gerais'!$A$4:$A$203))\n))","v":0},null,{"$f":"IF($F$18<>\"\",\n\"\",\nIF(OR($C271=\"\",$C271=0),\n   \"\",\n   IF(COUNTIF($C$19:C271,C271)=1,C271,\"\")\n))","v":""}]
[{"$f":"IF($F$18<>\"\",\n$F$18,\nIFERROR(\n   INDEX($E$19:$E$308,\n      _xlfn.AGGREGATE(15,6,\n         (ROW($E$19:$E$308)-ROW($E$19)+1)/($E$19:$E$308<>\"\"),\n         ROW()-ROW($A$19)+1\n      )\n   ),\n\"\"))","v":""},null,{"$f":"IF($F$18<>\"\",\n\"\",\nIF(ROW()-ROW($C$19)+1<=ROWS('Ações gerais'!$A$4:$A$203),\n   INDEX('Ações gerais'!$A$4:$A$203, ROW()-ROW($C$19)+1),\n   INDEX(Operacionalização!$A$4:$A$93, ROW()-ROW($C$19)+1 - ROWS('Ações gerais'!$A$4:$A$203))\n))","v":0},null,{"$f":"IF($F$18<>\"\",\n\"\",\nIF(OR($C272=\"\",$C272=0),\n   \"\",\n   IF(COUNTIF($C$19:C272,C272)=1,C272,\"\")\n))","v":""}]
[{"$f":"IF($F$18<>\"\",\n$F$18,\nIFERROR(\n   INDEX($E$19:$E$308,\n      _xlfn.AGGREGATE(15,6,\n         (ROW($E$19:$E$308)-ROW($E$19)+1)/($E$19:$E$308<>\"\"),\n         ROW()-ROW($A$19)+1\n      )\n   ),\n\"\"))","v":""},null,{"$f":"IF($F$18<>\"\",\n\"\",\nIF(ROW()-ROW($C$19)+1<=ROWS('Ações gerais'!$A$4:$A$203),\n   INDEX('Ações gerais'!$A$4:$A$203, ROW()-ROW($C$19)+1),\n   INDEX(Operacionalização!$A$4:$A$93, ROW()-ROW($C$19)+1 - ROWS('Ações gerais'!$A$4:$A$203))\n))","v":0},null,{"$f":"IF($F$18<>\"\",\n\"\",\nIF(OR($C273=\"\",$C273=0),\n   \"\",\n   IF(COUNTIF($C$19:C273,C273)=1,C273,\"\")\n))","v":""}]
[{"$f":"IF($F$18<>\"\",\n$F$18,\nIFERROR(\n   INDEX($E$19:$E$308,\n      _xlfn.AGGREGATE(15,6,\n         (ROW($E$19:$E$308)-ROW($E$19)+1)/($E$19:$E$308<>\"\"),\n         ROW()-ROW($A$19)+1\n      )\n   ),\n\"\"))","v":""},null,{"$f":"IF($F$18<>\"\",\n\"\",\nIF(ROW()-ROW($C$19)+1<=ROWS('Ações gerais'!$A$4:$A$203),\n   INDEX('Ações gerais'!$A$4:$A$203, ROW()-ROW($C$19)+1),\n   INDEX(Operacionalização!$A$4:$A$93, ROW()-ROW($C$19)+1 - ROWS('Ações gerais'!$A$4:$A$203))\n))","v":0},null,{"$f":"IF($F$18<>\"\",\n\"\",\nIF(OR($C274=\"\",$C274=0),\n   \"\",\n   IF(COUNTIF($C$19:C274,C274)=1,C274,\"\")\n))","v":""}]
[{"$f":"IF($F$18<>\"\",\n$F$18,\nIFERROR(\n   INDEX($E$19:$E$308,\n      _xlfn.AGGREGATE(15,6,\n         (ROW($E$19:$E$308)-ROW($E$19)+1)/($E$19:$E$308<>\"\"),\n         ROW()-ROW($A$19)+1\n      )\n   ),\n\"\"))","v":""},null,{"$f":"IF($F$18<>\"\",\n\"\",\nIF(ROW()-ROW($C$19)+1<=ROWS('Ações gerais'!$A$4:$A$203),\n   INDEX('Ações gerais'!$A$4:$A$203, ROW()-ROW($C$19)+1),\n   INDEX(Operacionalização!$A$4:$A$93, ROW()-ROW($C$19)+1 - ROWS('Ações gerais'!$A$4:$A$203))\n))","v":0},null,{"$f":"IF($F$18<>\"\",\n\"\",\nIF(OR($C275=\"\",$C275=0),\n   \"\",\n   IF(COUNTIF($C$19:C275,C275)=1,C275,\"\")\n))","v":""}]
[{"$f":"IF($F$18<>\"\",\n$F$18,\nIFERROR(\n   INDEX($E$19:$E$308,\n      _xlfn.AGGREGATE(15,6,\n         (ROW($E$19:$E$308)-ROW($E$19)+1)/($E$19:$E$308<>\"\"),\n         ROW()-ROW($A$19)+1\n      )\n   ),\n\"\"))","v":""},null,{"$f":"IF($F$18<>\"\",\n\"\",\nIF(ROW()-ROW($C$19)+1<=ROWS('Ações gerais'!$A$4:$A$203),\n   INDEX('Ações gerais'!$A$4:$A$203, ROW()-ROW($C$19)+1),\n   INDEX(Operacionalização!$A$4:$A$93, ROW()-ROW($C$19)+1 - ROWS('Ações gerais'!$A$4:$A$203))\n))","v":0},null,{"$f":"IF($F$18<>\"\",\n\"\",\nIF(OR($C276=\"\",$C276=0),\n   \"\",\n   IF(COUNTIF($C$19:C276,C276)=1,C276,\"\")\n))","v":""}]
[{"$f":"IF($F$18<>\"\",\n$F$18,\nIFERROR(\n   INDEX($E$19:$E$308,\n      _xlfn.AGGREGATE(15,6,\n         (ROW($E$19:$E$308)-ROW($E$19)+1)/($E$19:$E$308<>\"\"),\n         ROW()-ROW($A$19)+1\n      )\n   ),\n\"\"))","v":""},null,{"$f":"IF($F$18<>\"\",\n\"\",\nIF(ROW()-ROW($C$19)+1<=ROWS('Ações gerais'!$A$4:$A$203),\n   INDEX('Ações gerais'!$A$4:$A$203, ROW()-ROW($C$19)+1),\n   INDEX(Operacionalização!$A$4:$A$93, ROW()-ROW($C$19)+1 - ROWS('Ações gerais'!$A$4:$A$203))\n))","v":0},null,{"$f":"IF($F$18<>\"\",\n\"\",\nIF(OR($C277=\"\",$C277=0),\n   \"\",\n   IF(COUNTIF($C$19:C277,C277)=1,C277,\"\")\n))","v":""}]
[{"$f":"IF($F$18<>\"\",\n$F$18,\nIFERROR(\n   INDEX($E$19:$E$308,\n      _xlfn.AGGREGATE(15,6,\n         (ROW($E$19:$E$308)-ROW($E$19)+1)/($E$19:$E$308<>\"\"),\n         ROW()-ROW($A$19)+1\n      )\n   ),\n\"\"))","v":""},null,{"$f":"IF($F$18<>\"\",\n\"\",\nIF(ROW()-ROW($C$19)+1<=ROWS('Ações gerais'!$A$4:$A$203),\n   INDEX('Ações gerais'!$A$4:$A$203, ROW()-ROW($C$19)+1),\n   INDEX(Operacionalização!$A$4:$A$93, ROW()-ROW($C$19)+1 - ROWS('Ações gerais'!$A$4:$A$203))\n))","v":0},null,{"$f":"IF($F$18<>\"\",\n\"\",\nIF(OR($C278=\"\",$C278=0),\n   \"\",\n   IF(COUNTIF($C$19:C278,C278)=1,C278,\"\")\n))","v":""}]
[{"$f":"IF($F$18<>\"\",\n$F$18,\nIFERROR(\n   INDEX($E$19:$E$308,\n      _xlfn.AGGREGATE(15,6,\n         (ROW($E$19:$E$308)-ROW($E$19)+1)/($E$19:$E$308<>\"\"),\n         ROW()-ROW($A$19)+1\n      )\n   ),\n\"\"))","v":""},null,{"$f":"IF($F$18<>\"\",\n\"\",\nIF(ROW()-ROW($C$19)+1<=ROWS('Ações gerais'!$A$4:$A$203),\n   INDEX('Ações gerais'!$A$4:$A$203, ROW()-ROW($C$19)+1),\n   INDEX(Operacionalização!$A$4:$A$93, ROW()-ROW($C$19)+1 - ROWS('Ações gerais'!$A$4:$A$203))\n))","v":0},null,{"$f":"IF($F$18<>\"\",\n\"\",\nIF(OR($C279=\"\",$C279=0),\n   \"\",\n   IF(COUNTIF($C$19:C279,C279)=1,C279,\"\")\n))","v":""}]
[{"$f":"IF($F$18<>\"\",\n$F$18,\nIFERROR(\n   INDEX($E$19:$E$308,\n      _xlfn.AGGREGATE(15,6,\n         (ROW($E$19:$E$308)-ROW($E$19)+1)/($E$19:$E$308<>\"\"),\n         ROW()-ROW($A$19)+1\n      )\n   ),\n\"\"))","v":""},null,{"$f":"IF($F$18<>\"\",\n\"\",\nIF(ROW()-ROW($C$19)+1<=ROWS('Ações gerais'!$A$4:$A$203),\n   INDEX('Ações gerais'!$A$4:$A$203, ROW()-ROW($C$19)+1),\n   INDEX(Operacionalização!$A$4:$A$93, ROW()-ROW($C$19)+1 - ROWS('Ações gerais'!$A$4:$A$203))\n))","v":0},null,{"$f":"IF($F$18<>\"\",\n\"\",\nIF(OR($C280=\"\",$C280=0),\n   \"\",\n   IF(COUNTIF($C$19:C280,C280)=1,C280,\"\")\n))","v":""}]
[{"$f":"IF($F$18<>\"\",\n$F$18,\nIFERROR(\n   INDEX($E$19:$E$308,\n      _xlfn.AGGREGATE(15,6,\n         (ROW($E$19:$E$308)-ROW($E$19)+1)/($E$19:$E$308<>\"\"),\n         ROW()-ROW($A$19)+1\n      )\n   ),\n\"\"))","v":""},null,{"$f":"IF($F$18<>\"\",\n\"\",\nIF(ROW()-ROW($C$19)+1<=ROWS('Ações gerais'!$A$4:$A$203),\n   INDEX('Ações gerais'!$A$4:$A$203, ROW()-ROW($C$19)+1),\n   INDEX(Operacionalização!$A$4:$A$93, ROW()-ROW($C$19)+1 - ROWS('Ações gerais'!$A$4:$A$203))\n))","v":0},null,{"$f":"IF($F$18<>\"\",\n\"\",\nIF(OR($C281=\"\",$C281=0),\n   \"\",\n   IF(COUNTIF($C$19:C281,C281)=1,C281,\"\")\n))","v":""}]
[{"$f":"IF($F$18<>\"\",\n$F$18,\nIFERROR(\n   INDEX($E$19:$E$308,\n      _xlfn.AGGREGATE(15,6,\n         (ROW($E$19:$E$308)-ROW($E$19)+1)/($E$19:$E$308<>\"\"),\n         ROW()-ROW($A$19)+1\n      )\n   ),\n\"\"))","v":""},null,{"$f":"IF($F$18<>\"\",\n\"\",\nIF(ROW()-ROW($C$19)+1<=ROWS('Ações gerais'!$A$4:$A$203),\n   INDEX('Ações gerais'!$A$4:$A$203, ROW()-ROW($C$19)+1),\n   INDEX(Operacionalização!$A$4:$A$93, ROW()-ROW($C$19)+1 - ROWS('Ações gerais'!$A$4:$A$203))\n))","v":0},null,{"$f":"IF($F$18<>\"\",\n\"\",\nIF(OR($C282=\"\",$C282=0),\n   \"\",\n   IF(COUNTIF($C$19:C282,C282)=1,C282,\"\")\n))","v":""}]
[{"$f":"IF($F$18<>\"\",\n$F$18,\nIFERROR(\n   INDEX($E$19:$E$308,\n      _xlfn.AGGREGATE(15,6,\n         (ROW($E$19:$E$308)-ROW($E$19)+1)/($E$19:$E$308<>\"\"),\n         ROW()-ROW($A$19)+1\n      )\n   ),\n\"\"))","v":""},null,{"$f":"IF($F$18<>\"\",\n\"\",\nIF(ROW()-ROW($C$19)+1<=ROWS('Ações gerais'!$A$4:$A$203),\n   INDEX('Ações gerais'!$A$4:$A$203, ROW()-ROW($C$19)+1),\n   INDEX(Operacionalização!$A$4:$A$93, ROW()-ROW($C$19)+1 - ROWS('Ações gerais'!$A$4:$A$203))\n))","v":0},null,{"$f":"IF($F$18<>\"\",\n\"\",\nIF(OR($C283=\"\",$C283=0),\n   \"\",\n   IF(COUNTIF($C$19:C283,C283)=1,C283,\"\")\n))","v":""}]
[{"$f":"IF($F$18<>\"\",\n$F$18,\nIFERROR(\n   INDEX($E$19:$E$308,\n      _xlfn.AGGREGATE(15,6,\n         (ROW($E$19:$E$308)-ROW($E$19)+1)/($E$19:$E$308<>\"\"),\n         ROW()-ROW($A$19)+1\n      )\n   ),\n\"\"))","v":""},null,{"$f":"IF($F$18<>\"\",\n\"\",\nIF(ROW()-ROW($C$19)+1<=ROWS('Ações gerais'!$A$4:$A$203),\n   INDEX('Ações gerais'!$A$4:$A$203, ROW()-ROW($C$19)+1),\n   INDEX(Operacionalização!$A$4:$A$93, ROW()-ROW($C$19)+1 - ROWS('Ações gerais'!$A$4:$A$203))\n))","v":0},null,{"$f":"IF($F$18<>\"\",\n\"\",\nIF(OR($C284=\"\",$C284=0),\n   \"\",\n   IF(COUNTIF($C$19:C284,C284)=1,C284,\"\")\n))","v":""}]
[{"$f":"IF($F$18<>\"\",\n$F$18,\nIFERROR(\n   INDEX($E$19:$E$308,\n      _xlfn.AGGREGATE(15,6,\n         (ROW($E$19:$E$308)-ROW($E$19)+1)/($E$19:$E$308<>\"\"),\n         ROW()-ROW($A$19)+1\n      )\n   ),\n\"\"))","v":""},null,{"$f":"IF($F$18<>\"\",\n\"\",\nIF(ROW()-ROW($C$19)+1<=ROWS('Ações gerais'!$A$4:$A$203),\n   INDEX('Ações gerais'!$A$4:$A$203, ROW()-ROW($C$19)+1),\n   INDEX(Operacionalização!$A$4:$A$93, ROW()-ROW($C$19)+1 - ROWS('Ações gerais'!$A$4:$A$203))\n))","v":0},null,{"$f":"IF($F$18<>\"\",\n\"\",\nIF(OR($C285=\"\",$C285=0),\n   \"\",\n   IF(COUNTIF($C$19:C285,C285)=1,C285,\"\")\n))","v":""}]
[{"$f":"IF($F$18<>\"\",\n$F$18,\nIFERROR(\n   INDEX($E$19:$E$308,\n      _xlfn.AGGREGATE(15,6,\n         (ROW($E$19:$E$308)-ROW($E$19)+1)/($E$19:$E$308<>\"\"),\n         ROW()-ROW($A$19)+1\n      )\n   ),\n\"\"))","v":""},null,{"$f":"IF($F$18<>\"\",\n\"\",\nIF(ROW()-ROW($C$19)+1<=ROWS('Ações gerais'!$A$4:$A$203),\n   INDEX('Ações gerais'!$A$4:$A$203, ROW()-ROW($C$19)+1),\n   INDEX(Operacionalização!$A$4:$A$93, ROW()-ROW($C$19)+1 - ROWS('Ações gerais'!$A$4:$A$203))\n))","v":0},null,{"$f":"IF($F$18<>\"\",\n\"\",\nIF(OR($C286=\"\",$C286=0),\n   \"\",\n   IF(COUNTIF($C$19:C286,C286)=1,C286,\"\")\n))","v":""}]
[{"$f":"IF($F$18<>\"\",\n$F$18,\nIFERROR(\n   INDEX($E$19:$E$308,\n      _xlfn.AGGREGATE(15,6,\n         (ROW($E$19:$E$308)-ROW($E$19)+1)/($E$19:$E$308<>\"\"),\n         ROW()-ROW($A$19)+1\n      )\n   ),\n\"\"))","v":""},null,{"$f":"IF($F$18<>\"\",\n\"\",\nIF(ROW()-ROW($C$19)+1<=ROWS('Ações gerais'!$A$4:$A$203),\n   INDEX('Ações gerais'!$A$4:$A$203, ROW()-ROW($C$19)+1),\n   INDEX(Operacionalização!$A$4:$A$93, ROW()-ROW($C$19)+1 - ROWS('Ações gerais'!$A$4:$A$203))\n))","v":0},null,{"$f":"IF($F$18<>\"\",\n\"\",\nIF(OR($C287=\"\",$C287=0),\n   \"\",\n   IF(COUNTIF($C$19:C287,C287)=1,C287,\"\")\n))","v":""}]
[{"$f":"IF($F$18<>\"\",\n$F$18,\nIFERROR(\n   INDEX($E$19:$E$308,\n      _xlfn.AGGREGATE(15,6,\n         (ROW($E$19:$E$308)-ROW($E$19)+1)/($E$19:$E$308<>\"\"),\n         ROW()-ROW($A$19)+1\n      )\n   ),\n\"\"))","v":""},null,{"$f":"IF($F$18<>\"\",\n\"\",\nIF(ROW()-ROW($C$19)+1<=ROWS('Ações gerais'!$A$4:$A$203),\n   INDEX('Ações gerais'!$A$4:$A$203, ROW()-ROW($C$19)+1),\n   INDEX(Operacionalização!$A$4:$A$93, ROW()-ROW($C$19)+1 - ROWS('Ações gerais'!$A$4:$A$203))\n))","v":0},null,{"$f":"IF($F$18<>\"\",\n\"\",\nIF(OR($C288=\"\",$C288=0),\n   \"\",\n   IF(COUNTIF($C$19:C288,C288)=1,C288,\"\")\n))","v":""}]
[{"$f":"IF($F$18<>\"\",\n$F$18,\nIFERROR(\n   INDEX($E$19:$E$308,\n      _xlfn.AGGREGATE(15,6,\n         (ROW($E$19:$E$308)-ROW($E$19)+1)/($E$19:$E$308<>\"\"),\n         ROW()-ROW($A$19)+1\n      )\n   ),\n\"\"))","v":""},null,{"$f":"IF($F$18<>\"\",\n\"\",\nIF(ROW()-ROW($C$19)+1<=ROWS('Ações gerais'!$A$4:$A$203),\n   INDEX('Ações gerais'!$A$4:$A$203, ROW()-ROW($C$19)+1),\n   INDEX(Operacionalização!$A$4:$A$93, ROW()-ROW($C$19)+1 - ROWS('Ações gerais'!$A$4:$A$203))\n))","v":0},null,{"$f":"IF($F$18<>\"\",\n\"\",\nIF(OR($C289=\"\",$C289=0),\n   \"\",\n   IF(COUNTIF($C$19:C289,C289)=1,C289,\"\")\n))","v":""}]
[{"$f":"IF($F$18<>\"\",\n$F$18,\nIFERROR(\n   INDEX($E$19:$E$308,\n      _xlfn.AGGREGATE(15,6,\n         (ROW($E$19:$E$308)-ROW($E$19)+1)/($E$19:$E$308<>\"\"),\n         ROW()-ROW($A$19)+1\n      )\n   ),\n\"\"))","v":""},null,{"$f":"IF($F$18<>\"\",\n\"\",\nIF(ROW()-ROW($C$19)+1<=ROWS('Ações gerais'!$A$4:$A$203),\n   INDEX('Ações gerais'!$A$4:$A$203, ROW()-ROW($C$19)+1),\n   INDEX(Operacionalização!$A$4:$A$93, ROW()-ROW($C$19)+1 - ROWS('Ações gerais'!$A$4:$A$203))\n))","v":0},null,{"$f":"IF($F$18<>\"\",\n\"\",\nIF(OR($C290=\"\",$C290=0),\n   \"\",\n   IF(COUNTIF($C$19:C290,C290)=1,C290,\"\")\n))","v":""}]
[{"$f":"IF($F$18<>\"\",\n$F$18,\nIFERROR(\n   INDEX($E$19:$E$308,\n      _xlfn.AGGREGATE(15,6,\n         (ROW($E$19:$E$308)-ROW($E$19)+1)/($E$19:$E$308<>\"\"),\n         ROW()-ROW($A$19)+1\n      )\n   ),\n\"\"))","v":""},null,{"$f":"IF($F$18<>\"\",\n\"\",\nIF(ROW()-ROW($C$19)+1<=ROWS('Ações gerais'!$A$4:$A$203),\n   INDEX('Ações gerais'!$A$4:$A$203, ROW()-ROW($C$19)+1),\n   INDEX(Operacionalização!$A$4:$A$93, ROW()-ROW($C$19)+1 - ROWS('Ações gerais'!$A$4:$A$203))\n))","v":0},null,{"$f":"IF($F$18<>\"\",\n\"\",\nIF(OR($C291=\"\",$C291=0),\n   \"\",\n   IF(COUNTIF($C$19:C291,C291)=1,C291,\"\")\n))","v":""}]
[{"$f":"IF($F$18<>\"\",\n$F$18,\nIFERROR(\n   INDEX($E$19:$E$308,\n      _xlfn.AGGREGATE(15,6,\n         (ROW($E$19:$E$308)-ROW($E$19)+1)/($E$19:$E$308<>\"\"),\n         ROW()-ROW($A$19)+1\n      )\n   ),\n\"\"))","v":""},null,{"$f":"IF($F$18<>\"\",\n\"\",\nIF(ROW()-ROW($C$19)+1<=ROWS('Ações gerais'!$A$4:$A$203),\n   INDEX('Ações gerais'!$A$4:$A$203, ROW()-ROW($C$19)+1),\n   INDEX(Operacionalização!$A$4:$A$93, ROW()-ROW($C$19)+1 - ROWS('Ações gerais'!$A$4:$A$203))\n))","v":0},null,{"$f":"IF($F$18<>\"\",\n\"\",\nIF(OR($C292=\"\",$C292=0),\n   \"\",\n   IF(COUNTIF($C$19:C292,C292)=1,C292,\"\")\n))","v":""}]
[{"$f":"IF($F$18<>\"\",\n$F$18,\nIFERROR(\n   INDEX($E$19:$E$308,\n      _xlfn.AGGREGATE(15,6,\n         (ROW($E$19:$E$308)-ROW($E$19)+1)/($E$19:$E$308<>\"\"),\n         ROW()-ROW($A$19)+1\n      )\n   ),\n\"\"))","v":""},null,{"$f":"IF($F$18<>\"\",\n\"\",\nIF(ROW()-ROW($C$19)+1<=ROWS('Ações gerais'!$A$4:$A$203),\n   INDEX('Ações gerais'!$A$4:$A$203, ROW()-ROW($C$19)+1),\n   INDEX(Operacionalização!$A$4:$A$93, ROW()-ROW($C$19)+1 - ROWS('Ações gerais'!$A$4:$A$203))\n))","v":0},null,{"$f":"IF($F$18<>\"\",\n\"\",\nIF(OR($C293=\"\",$C293=0),\n   \"\",\n   IF(COUNTIF($C$19:C293,C293)=1,C293,\"\")\n))","v":""}]
[{"$f":"IF($F$18<>\"\",\n$F$18,\nIFERROR(\n   INDEX($E$19:$E$308,\n      _xlfn.AGGREGATE(15,6,\n         (ROW($E$19:$E$308)-ROW($E$19)+1)/($E$19:$E$308<>\"\"),\n         ROW()-ROW($A$19)+1\n      )\n   ),\n\"\"))","v":""},null,{"$f":"IF($F$18<>\"\",\n\"\",\nIF(ROW()-ROW($C$19)+1<=ROWS('Ações gerais'!$A$4:$A$203),\n   INDEX('Ações gerais'!$A$4:$A$203, ROW()-ROW($C$19)+1),\n   INDEX(Operacionalização!$A$4:$A$93, ROW()-ROW($C$19)+1 - ROWS('Ações gerais'!$A$4:$A$203))\n))","v":0},null,{"$f":"IF($F$18<>\"\",\n\"\",\nIF(OR($C294=\"\",$C294=0),\n   \"\",\n   IF(COUNTIF($C$19:C294,C294)=1,C294,\"\")\n))","v":""}]
[{"$f":"IF($F$18<>\"\",\n$F$18,\nIFERROR(\n   INDEX($E$19:$E$308,\n      _xlfn.AGGREGATE(15,6,\n         (ROW($E$19:$E$308)-ROW($E$19)+1)/($E$19:$E$308<>\"\"),\n         ROW()-ROW($A$19)+1\n      )\n   ),\n\"\"))","v":""},null,{"$f":"IF($F$18<>\"\",\n\"\",\nIF(ROW()-ROW($C$19)+1<=ROWS('Ações gerais'!$A$4:$A$203),\n   INDEX('Ações gerais'!$A$4:$A$203, ROW()-ROW($C$19)+1),\n   INDEX(Operacionalização!$A$4:$A$93, ROW()-ROW($C$19)+1 - ROWS('Ações gerais'!$A$4:$A$203))\n))","v":0},null,{"$f":"IF($F$18<>\"\",\n\"\",\nIF(OR($C295=\"\",$C295=0),\n   \"\",\n   IF(COUNTIF($C$19:C295,C295)=1,C295,\"\")\n))","v":""}]
[{"$f":"IF($F$18<>\"\",\n$F$18,\nIFERROR(\n   INDEX($E$19:$E$308,\n      _xlfn.AGGREGATE(15,6,\n         (ROW($E$19:$E$308)-ROW($E$19)+1)/($E$19:$E$308<>\"\"),\n         ROW()-ROW($A$19)+1\n      )\n   ),\n\"\"))","v":""},null,{"$f":"IF($F$18<>\"\",\n\"\",\nIF(ROW()-ROW($C$19)+1<=ROWS('Ações gerais'!$A$4:$A$203),\n   INDEX('Ações gerais'!$A$4:$A$203, ROW()-ROW($C$19)+1),\n   INDEX(Operacionalização!$A$4:$A$93, ROW()-ROW($C$19)+1 - ROWS('Ações gerais'!$A$4:$A$203))\n))","v":0},null,{"$f":"IF($F$18<>\"\",\n\"\",\nIF(OR($C296=\"\",$C296=0),\n   \"\",\n   IF(COUNTIF($C$19:C296,C296)=1,C296,\"\")\n))","v":""}]
[{"$f":"IF($F$18<>\"\",\n$F$18,\nIFERROR(\n   INDEX($E$19:$E$308,\n      _xlfn.AGGREGATE(15,6,\n         (ROW($E$19:$E$308)-ROW($E$19)+1)/($E$19:$E$308<>\"\"),\n         ROW()-ROW($A$19)+1\n      )\n   ),\n\"\"))","v":""},null,{"$f":"IF($F$18<>\"\",\n\"\",\nIF(ROW()-ROW($C$19)+1<=ROWS('Ações gerais'!$A$4:$A$203),\n   INDEX('Ações gerais'!$A$4:$A$203, ROW()-ROW($C$19)+1),\n   INDEX(Operacionalização!$A$4:$A$93, ROW()-ROW($C$19)+1 - ROWS('Ações gerais'!$A$4:$A$203))\n))","v":0},null,{"$f":"IF($F$18<>\"\",\n\"\",\nIF(OR($C297=\"\",$C297=0),\n   \"\",\n   IF(COUNTIF($C$19:C297,C297)=1,C297,\"\")\n))","v":""}]
[{"$f":"IF($F$18<>\"\",\n$F$18,\nIFERROR(\n   INDEX($E$19:$E$308,\n      _xlfn.AGGREGATE(15,6,\n         (ROW($E$19:$E$308)-ROW($E$19)+1)/($E$19:$E$308<>\"\"),\n         ROW()-ROW($A$19)+1\n      )\n   ),\n\"\"))","v":""},null,{"$f":"IF($F$18<>\"\",\n\"\",\nIF(ROW()-ROW($C$19)+1<=ROWS('Ações gerais'!$A$4:$A$203),\n   INDEX('Ações gerais'!$A$4:$A$203, ROW()-ROW($C$19)+1),\n   INDEX(Operacionalização!$A$4:$A$93, ROW()-ROW($C$19)+1 - ROWS('Ações gerais'!$A$4:$A$203))\n))","v":0},null,{"$f":"IF($F$18<>\"\",\n\"\",\nIF(OR($C298=\"\",$C298=0),\n   \"\",\n   IF(COUNTIF($C$19:C298,C298)=1,C298,\"\")\n))","v":""}]
[{"$f":"IF($F$18<>\"\",\n$F$18,\nIFERROR(\n   INDEX($E$19:$E$308,\n      _xlfn.AGGREGATE(15,6,\n         (ROW($E$19:$E$308)-ROW($E$19)+1)/($E$19:$E$308<>\"\"),\n         ROW()-ROW($A$19)+1\n      )\n   ),\n\"\"))","v":""},null,{"$f":"IF($F$18<>\"\",\n\"\",\nIF(ROW()-ROW($C$19)+1<=ROWS('Ações gerais'!$A$4:$A$203),\n   INDEX('Ações gerais'!$A$4:$A$203, ROW()-ROW($C$19)+1),\n   INDEX(Operacionalização!$A$4:$A$93, ROW()-ROW($C$19)+1 - ROWS('Ações gerais'!$A$4:$A$203))\n))","v":0},null,{"$f":"IF($F$18<>\"\",\n\"\",\nIF(OR($C299=\"\",$C299=0),\n   \"\",\n   IF(COUNTIF($C$19:C299,C299)=1,C299,\"\")\n))","v":""}]
[{"$f":"IF($F$18<>\"\",\n$F$18,\nIFERROR(\n   INDEX($E$19:$E$308,\n      _xlfn.AGGREGATE(15,6,\n         (ROW($E$19:$E$308)-ROW($E$19)+1)/($E$19:$E$308<>\"\"),\n         ROW()-ROW($A$19)+1\n      )\n   ),\n\"\"))","v":""},null,{"$f":"IF($F$18<>\"\",\n\"\",\nIF(ROW()-ROW($C$19)+1<=ROWS('Ações gerais'!$A$4:$A$203),\n   INDEX('Ações gerais'!$A$4:$A$203, ROW()-ROW($C$19)+1),\n   INDEX(Operacionalização!$A$4:$A$93, ROW()-ROW($C$19)+1 - ROWS('Ações gerais'!$A$4:$A$203))\n))","v":0},null,{"$f":"IF($F$18<>\"\",\n\"\",\nIF(OR($C300=\"\",$C300=0),\n   \"\",\n   IF(COUNTIF($C$19:C300,C300)=1,C300,\"\")\n))","v":""}]
[{"$f":"IF($F$18<>\"\",\n$F$18,\nIFERROR(\n   INDEX($E$19:$E$308,\n      _xlfn.AGGREGATE(15,6,\n         (ROW($E$19:$E$308)-ROW($E$19)+1)/($E$19:$E$308<>\"\"),\n         ROW()-ROW($A$19)+1\n      )\n   ),\n\"\"))","v":""},null,{"$f":"IF($F$18<>\"\",\n\"\",\nIF(ROW()-ROW($C$19)+1<=ROWS('Ações gerais'!$A$4:$A$203),\n   INDEX('Ações gerais'!$A$4:$A$203, ROW()-ROW($C$19)+1),\n   INDEX(Operacionalização!$A$4:$A$93, ROW()-ROW($C$19)+1 - ROWS('Ações gerais'!$A$4:$A$203))\n))","v":0},null,{"$f":"IF($F$18<>\"\",\n\"\",\nIF(OR($C301=\"\",$C301=0),\n   \"\",\n   IF(COUNTIF($C$19:C301,C301)=1,C301,\"\")\n))","v":""}]
[{"$f":"IF($F$18<>\"\",\n$F$18,\nIFERROR(\n   INDEX($E$19:$E$308,\n      _xlfn.AGGREGATE(15,6,\n         (ROW($E$19:$E$308)-ROW($E$19)+1)/($E$19:$E$308<>\"\"),\n         ROW()-ROW($A$19)+1\n      )\n   ),\n\"\"))","v":""},null,{"$f":"IF($F$18<>\"\",\n\"\",\nIF(ROW()-ROW($C$19)+1<=ROWS('Ações gerais'!$A$4:$A$203),\n   INDEX('Ações gerais'!$A$4:$A$203, ROW()-ROW($C$19)+1),\n   INDEX(Operacionalização!$A$4:$A$93, ROW()-ROW($C$19)+1 - ROWS('Ações gerais'!$A$4:$A$203))\n))","v":0},null,{"$f":"IF($F$18<>\"\",\n\"\",\nIF(OR($C302=\"\",$C302=0),\n   \"\",\n   IF(COUNTIF($C$19:C302,C302)=1,C302,\"\")\n))","v":""}]
[{"$f":"IF($F$18<>\"\",\n$F$18,\nIFERROR(\n   INDEX($E$19:$E$308,\n      _xlfn.AGGREGATE(15,6,\n         (ROW($E$19:$E$308)-ROW($E$19)+1)/($E$19:$E$308<>\"\"),\n         ROW()-ROW($A$19)+1\n      )\n   ),\n\"\"))","v":""},null,{"$f":"IF($F$18<>\"\",\n\"\",\nIF(ROW()-ROW($C$19)+1<=ROWS('Ações gerais'!$A$4:$A$203),\n   INDEX('Ações gerais'!$A$4:$A$203, ROW()-ROW($C$19)+1),\n   INDEX(Operacionalização!$A$4:$A$93, ROW()-ROW($C$19)+1 - ROWS('Ações gerais'!$A$4:$A$203))\n))","v":0},null,{"$f":"IF($F$18<>\"\",\n\"\",\nIF(OR($C303=\"\",$C303=0),\n   \"\",\n   IF(COUNTIF($C$19:C303,C303)=1,C303,\"\")\n))","v":""}]
[{"$f":"IF($F$18<>\"\",\n$F$18,\nIFERROR(\n   INDEX($E$19:$E$308,\n      _xlfn.AGGREGATE(15,6,\n         (ROW($E$19:$E$308)-ROW($E$19)+1)/($E$19:$E$308<>\"\"),\n         ROW()-ROW($A$19)+1\n      )\n   ),\n\"\"))","v":""},null,{"$f":"IF($F$18<>\"\",\n\"\",\nIF(ROW()-ROW($C$19)+1<=ROWS('Ações gerais'!$A$4:$A$203),\n   INDEX('Ações gerais'!$A$4:$A$203, ROW()-ROW($C$19)+1),\n   INDEX(Operacionalização!$A$4:$A$93, ROW()-ROW($C$19)+1 - ROWS('Ações gerais'!$A$4:$A$203))\n))","v":0},null,{"$f":"IF($F$18<>\"\",\n\"\",\nIF(OR($C304=\"\",$C304=0),\n   \"\",\n   IF(COUNTIF($C$19:C304,C304)=1,C304,\"\")\n))","v":""}]
[{"$f":"IF($F$18<>\"\",\n$F$18,\nIFERROR(\n   INDEX($E$19:$E$308,\n      _xlfn.AGGREGATE(15,6,\n         (ROW($E$19:$E$308)-ROW($E$19)+1)/($E$19:$E$308<>\"\"),\n         ROW()-ROW($A$19)+1\n      )\n   ),\n\"\"))","v":""},null,{"$f":"IF($F$18<>\"\",\n\"\",\nIF(ROW()-ROW($C$19)+1<=ROWS('Ações gerais'!$A$4:$A$203),\n   INDEX('Ações gerais'!$A$4:$A$203, ROW()-ROW($C$19)+1),\n   INDEX(Operacionalização!$A$4:$A$93, ROW()-ROW($C$19)+1 - ROWS('Ações gerais'!$A$4:$A$203))\n))","v":0},null,{"$f":"IF($F$18<>\"\",\n\"\",\nIF(OR($C305=\"\",$C305=0),\n   \"\",\n   IF(COUNTIF($C$19:C305,C305)=1,C305,\"\")\n))","v":""}]
[{"$f":"IF($F$18<>\"\",\n$F$18,\nIFERROR(\n   INDEX($E$19:$E$308,\n      _xlfn.AGGREGATE(15,6,\n         (ROW($E$19:$E$308)-ROW($E$19)+1)/($E$19:$E$308<>\"\"),\n         ROW()-ROW($A$19)+1\n      )\n   ),\n\"\"))","v":""},null,{"$f":"IF($F$18<>\"\",\n\"\",\nIF(ROW()-ROW($C$19)+1<=ROWS('Ações gerais'!$A$4:$A$203),\n   INDEX('Ações gerais'!$A$4:$A$203, ROW()-ROW($C$19)+1),\n   INDEX(Operacionalização!$A$4:$A$93, ROW()-ROW($C$19)+1 - ROWS('Ações gerais'!$A$4:$A$203))\n))","v":0},null,{"$f":"IF($F$18<>\"\",\n\"\",\nIF(OR($C306=\"\",$C306=0),\n   \"\",\n   IF(COUNTIF($C$19:C306,C306)=1,C306,\"\")\n))","v":""}]
[{"$f":"IF($F$18<>\"\",\n$F$18,\nIFERROR(\n   INDEX($E$19:$E$308,\n      _xlfn.AGGREGATE(15,6,\n         (ROW($E$19:$E$308)-ROW($E$19)+1)/($E$19:$E$308<>\"\"),\n         ROW()-ROW($A$19)+1\n      )\n   ),\n\"\"))","v":""},null,{"$f":"IF($F$18<>\"\",\n\"\",\nIF(ROW()-ROW($C$19)+1<=ROWS('Ações gerais'!$A$4:$A$203),\n   INDEX('Ações gerais'!$A$4:$A$203, ROW()-ROW($C$19)+1),\n   INDEX(Operacionalização!$A$4:$A$93, ROW()-ROW($C$19)+1 - ROWS('Ações gerais'!$A$4:$A$203))\n))","v":0},null,{"$f":"IF($F$18<>\"\",\n\"\",\nIF(OR($C307=\"\",$C307=0),\n   \"\",\n   IF(COUNTIF($C$19:C307,C307)=1,C307,\"\")\n))","v":""}]
[{"$f":"IF($F$18<>\"\",\n$F$18,\nIFERROR(\n   INDEX($E$19:$E$308,\n      _xlfn.AGGREGATE(15,6,\n         (ROW($E$19:$E$308)-ROW($E$19)+1)/($E$19:$E$308<>\"\"),\n         ROW()-ROW($A$19)+1\n      )\n   ),\n\"\"))","v":""},null,{"$f":"IF($F$18<>\"\",\n\"\",\nIF(ROW()-ROW($C$19)+1<=ROWS('Ações gerais'!$A$4:$A$203),\n   INDEX('Ações gerais'!$A$4:$A$203, ROW()-ROW($C$19)+1),\n   INDEX(Operacionalização!$A$4:$A$93, ROW()-ROW($C$19)+1 - ROWS('Ações gerais'!$A$4:$A$203))\n))","v":0},null,{"$f":"IF($F$18<>\"\",\n\"\",\nIF(OR($C308=\"\",$C308=0),\n   \"\",\n   IF(COUNTIF($C$19:C308,C308)=1,C308,\"\")\n))","v":""}]

{"sheet":"Config","index":7,"n_rows":1,"n_cols":2,"rows_kept":1,"cut":false,"hidden":true,"merged":[]}
["Senha","CULTURAFAF2023"]

{"sheet":"MapaCPFsGeral","index":8,"n_rows":128,"n_cols":2,"rows_kept":128,"cut":false,"hidden":true,"merged":[]}
["Original","Anonimizado"]
[11111111111,"***11111***"]
["111.111.111-11","***11111***"]
[11144477735,"***77735***"]
[22255588809,"***88809***"]
[33366699980,"***99980***"]
[44477700046,"***00046***"]
[55588811110,"***11110***"]
[66699922291,"***22291***"]
[77700033357,"***33357***"]
[88811144421,"***44421***"]
[99922255502,"***55502***"]
[33366678,"***66678***"]
[12345678909,"***78909***"]
[98765432100,"***32100***"]
[15975348620,"***48620***"]
[25845678910,"***78910***"]
[35715925869,"***25869***"]
[65498732122,"***32122***"]
[74185296303,"***96303***"]
[85296374144,"***74144***"]
[96374185216,"***85216***"]
[14725836940,"***36940***"]
[11144477735,"***77735***"]
[22255588809,"***88809***"]
[33366699980,"***99980***"]
[44477700046,"***00046***"]
[55588811110,"***11110***"]
[66699922291,"***22291***"]
[77700033357,"***33357***"]
[88811144421,"***44421***"]
[99922255502,"***55502***"]
[33366678,"***66678***"]
[12345678909,"***78909***"]
[98765432100,"***32100***"]
[15975348620,"***48620***"]
[25845678910,"***78910***"]
[35715925869,"***25869***"]
[65498732122,"***32122***"]
[74185296303,"***96303***"]
[85296374144,"***74144***"]
[96374185216,"***85216***"]
[14725836940,"***36940***"]
[11144477735,"***77735***"]
[22255588809,"***88809***"]
[33366699980,"***99980***"]
[44477700046,"***00046***"]
[55588811110,"***11110***"]
[66699922291,"***22291***"]
[77700033357,"***33357***"]
[88811144421,"***44421***"]
[99922255502,"***55502***"]
[33366678,"***66678***"]
[12345678909,"***78909***"]
[98765432100,"***32100***"]
[15975348620,"***48620***"]
[25845678910,"***78910***"]
[35715925869,"***25869***"]
[65498732122,"***32122***"]
[74185296303,"***96303***"]
[85296374144,"***74144***"]
[96374185216,"***85216***"]
[14725836940,"***36940***"]
[11144477735,"***77735***"]
[22255588809,"***88809***"]
[33366699980,"***99980***"]
[44477700046,"***00046***"]
[55588811110,"***11110***"]
[66699922291,"***22291***"]
[77700033357,"***33357***"]
[88811144421,"***44421***"]
[99922255502,"***55502***"]
[33366678,"***66678***"]
[12345678909,"***78909***"]
[98765432100,"***32100***"]
[15975348620,"***48620***"]
[25845678910,"***78910***"]
[35715925869,"***25869***"]
[65498732122,"***32122***"]
[74185296303,"***96303***"]
[85296374144,"***74144***"]
[96374185216,"***85216***"]
[14725836940,"***36940***"]
[6771889602,"***889602**"]
[6771889602,"***889602**"]
[6771889602,"***889602**"]
[12345678909,"***678909**"]
[98765432100,"***432100**"]
[11122233396,"***233396**"]
[22233344405,"***344405**"]
[33344455574,"***455574**"]
[44455566630,"***566630**"]
[55566677708,"***677708**"]
[66677788887,"***788887**"]
[77788899953,"***899953**"]
[88899900001,"***900001**"]
["002.348.571-02","***857102**"]
["034.433.351-52","***335152**"]
["082.762.111-60","***211160**"]
["084.209.781-32","***978132**"]
["009.536.701-20","***670120**"]
["026.582.481-80","***248180**"]
["046.251.131-64","***113164**"]
["040.277.421-33","***742133**"]
["054.800.931-77","***093177**"]
["549.848.581-68","***858168**"]
["063.038.291-39","***829139**"]
["060.599.741-12","***974112**"]
["011.514.201-07","***420107**"]
["657.430.755-49","***075549**"]
["031.347.691-82","***769182**"]
["008.807.631-83","***763183**"]
["000.989.541-80","***954180**"]
["064.080.703-88","***070388**"]
["582.040.241-34","***024134**"]
["048.255.791-59","***579159**"]
["033.602.461-44","***246144**"]
["395.098.421-68","***842168**"]
["411.576.301-97","***630197**"]
["632.711.501-25","***150125**"]
["052.671.571-55","***157155**"]
["067.981.861-81","***186181**"]
["067.431.981-88","***198188**"]
["704.604.341-87","***434187**"]
["757.139.001-00","***900100**"]
["063.038.771-09","***877109**"]
["015.780.131-43","***013143**"]
["622.005.001-06","***500106**"]

{"sheet":"MapaCPFsPNCV","index":9,"n_rows":71,"n_cols":2,"rows_kept":71,"cut":false,"hidden":true,"merged":[]}
["Original","Anonimizado"]
["111.111.111-11","***11111***"]
["111.444.777-35","***77735***"]
["222.555.888-09","***88809***"]
["333.666.999-80","***99980***"]
["444.777.000-46","***00046***"]
["555.888.111-10","***11110***"]
["666.999.222-91","***22291***"]
["777.000.333-57","***33357***"]
["888.111.444-21","***44421***"]
["999.222.555-02","***55502***"]
[33366678,"***66678***"]
["123.456.789-09","***78909***"]
["987.654.321-00","***32100***"]
["159.753.486-20","***48620***"]
["258.456.789-10","***78910***"]
["357.159.258-69","***25869***"]
["654.987.321-22","***32122***"]
["741.852.963-03","***96303***"]
["852.963.741-44","***74144***"]
["963.741.852-16","***85216***"]
["147.258.369-40","***36940***"]
[11144477735,"***77735***"]
[22255588809,"***88809***"]
[33366699980,"***99980***"]
[44477700046,"***00046***"]
[55588811110,"***11110***"]
[66699922291,"***22291***"]
[77700033357,"***33357***"]
[88811144421,"***44421***"]
[99922255502,"***55502***"]
[33366678,"***66678***"]
[12345678909,"***78909***"]
[98765432100,"***32100***"]
[15975348620,"***48620***"]
[25845678910,"***78910***"]
[35715925869,"***25869***"]
[65498732122,"***32122***"]
[74185296303,"***96303***"]
[85296374144,"***74144***"]
[96374185216,"***85216***"]
[14725836940,"***36940***"]
[11111111111,"***111111**"]
[6771889602,"***889602**"]
[6522255510,"***255510**"]
["111.222.333-96","***233396**"]
["222.333.444-05","***344405**"]
["333.444.555-74","***455574**"]
["444.555.666-30","***566630**"]
["555.666.777-08","***677708**"]
["666.777.888-87","***788887**"]
["777.888.999-53","***899953**"]
["888.999.000-01","***900001**"]
[6771889602,"***889602**"]
[5223665598,"***665598**"]
["067.718.896-02","***889602**"]
[6771889625,"***889625**"]
[6771889602,"***889602**"]
[6771889602,"***889602**"]
[12345678909,"***678909**"]
[98765432100,"***432100**"]
[11122233396,"***233396**"]
[22233344405,"***344405**"]
[33344455574,"***455574**"]
[44455566630,"***566630**"]
[55566677708,"***677708**"]
[66677788887,"***788887**"]
[77788899953,"***899953**"]
[88899900001,"***900001**"]
[6771889602,"***889602**"]
[0,"***0**"]